{"text_format":"1","workbook":"xlsx","n_sheets":7,"sheets":["Main","Pie chart","Diffusion model","Price curves","Scenario saver","Assumptions","Feature importance"],"not_rendered":{"charts":6,"images":14,"macros":1,"external_links":2,"defined_names":101,"comments":4,"pivot_tables":1},"unopened":[{"sheet":"Pie chart","index":1,"reason":"not_a_worksheet"}],"bounds":{"document_bytes":16777216,"sheet_cells":100000,"rows_first":2000,"rows_last":500,"rows_between":2000,"halvings":0,"cell_chars":16384,"cell_head_chars":4096},"cells_cut":0,"cells_raw":0,"read":"whole","date_system":"1900"}

{"sheet":"Main","index":0,"n_rows":555,"n_cols":101,"rows_kept":555,"cut":false,"hidden":false,"merged":[[182,0,182,1],[149,36,149,40],[151,44,151,47],[151,48,151,50],[150,53,150,56],[152,0,152,1],[151,10,151,12],[151,28,151,34],[151,95,151,99],[15,0,15,1],[0,78,0,83],[2,78,3,78],[4,78,5,78],[151,79,151,83],[151,84,151,88],[151,90,151,94],[151,65,151,72],[8,0,8,1],[9,0,9,1],[11,0,11,1],[15,2,22,2]]}
["Company Name",null,null,null,null,null,"Created by StatWizards®",null,null,null,null,"$H$18",null,null,null,null,null,null,null,null,null,null,null,null,null,null,null,null,null,null,null,null,null,null,null,null,null,null,null,null,null,null,null,null,null,null,null,null,null,null,null,null,null,null,null,null,null,null,null,null,null,null,null,null,null,null,null,null,null,null,null,null,null,null,null,null,null,null,"Attribute translation table"]
["Market Simulator",null,null,null,null,null,"Simulator version: 18.9",null,null,null,null,null,null,null,null,null,null,null,null,null,null,null,null,null,null,null,null,null,null,null,null,null,null,null,null,null,null,null,null,null,null,null,null,null,null,null,null,null,null,null,null,null,null,null,null,null,null,null,null,null,null,null,null,null,null,null,null,null,null,null,null,null,null,null,null,null,null,null,null,null,{"$f":"H11","v":"Your prod."},{"$f":"I11","v":"B"},"C","D"]
["Directions:","1. Enter assumptions in the blue input areas. To copy and paste, paste Values only.",null,null,null,null,null,null,null,null,null,null,null,null,null,null,null,null,null,null,null,null,null,null,null,null,null,null,null,null,null,null,null,null,null,null,null,null,null,null,null,null,null,null,null,null,null,null,null,null,null,null,null,null,null,null,null,null,null,null,null,null,null,null,null,null,null,null,null,null,null,null,null,null,null,null,null,null,{"$f":"IF(FIND(\":\",$G$13)>0,LEFT($G$13,LEN($G$13)-1),$G$13)","v":"Fashion"},"Traditional",{"$f":"IF(H$13=$CB3,1,0)","v":1},{"$f":"IF(I$13=$CB3,1,0)","v":0},1,0]
[null,"2. In the Product Marketplace, describe the packages you want to simulate.",null,null,null,null,null,null,null,null,null,null,null,null,null,null,null,null,null,null,null,null,null,null,null,null,null,null,null,null,null,null,null,null,null,null,null,null,null,null,null,null,null,null,null,null,null,null,null,null,null,null,null,null,null,null,null,null,null,null,null,null,null,null,null,null,null,null,null,null,null,null,null,null,null,null,null,null,null,"Modern",{"$f":"IF(H$13=$CB4,1,0)","v":0},1,0,0]
[null,"3. View results in the pie chart and summary cells.",null,null,null,null,null,null,null,null,null,null,null,null,null,null,null,null,null,null,null,null,null,null,null,null,null,null,null,null,null,null,null,null,null,null,null,null,null,null,null,null,null,null,null,null,null,null,null,null,null,null,null,null,null,null,null,null,null,null,null,null,null,null,null,null,null,null,null,null,null,null,null,null,null,null,null,null,{"$f":"IF(FIND(\":\",$G$14)>0,LEFT($G$14,LEN($G$14)-1),$G$14)","v":"Quality"},"Standard",{"$f":"IF(H$14=$CB5,1,0)","v":0},{"$f":"IF(I$14=$CB5,1,0)","v":1},1,0]
[null,"4. For help on a topic, move mouse over a cell with a red triangle in the corner.",null,null,null,null,null,null,null,null,null,null,null,null,null,null,null,null,null,null,null,null,null,null,null,null,null,null,null,null,null,null,null,null,null,null,null,null,null,null,null,null,null,null,null,null,null,null,null,null,null,null,null,null,null,null,null,null,null,null,null,null,null,null,null,null,null,null,null,null,null,null,null,null,null,null,null,null,null,"High",{"$f":"IF(H$14=$CB6,1,0)","v":1},0,0,0]
[null,"5. For online help using the simulator's features, click",null,null,null,null,"here.",null,null,null,null,null,null,null,null,null,null,null,null,null,null,null,null,null,null,null,null,null,null,null,null,null,null,null,null,null,null,null,null,null,null,null,null,null,null,null,null,null,null,null,null,null,null,null,null,null,null,null,null,null,null,null,null,null,null,null,null,null,null,null,null,null,null,null,null,null,null,null,null,"Price",{"$f":"H$15","v":99},{"$f":"I$15","v":125},25,0]
[]
["Scenario Name"]
["Basic"]
[null,null,null,null,null,null,"Product Marketplace","Your prod.","B","C","D"]
["Assumptions",null,null,null,null,null,"Package name:","High-end","Stylish","Basic",null,"None"]
["Target market size (000):",{"$f":"Assumptions!$R$62","v":226754},null,null,null,null,"Fashion:","Traditional","Modern","Traditional"]
["Units:",{"$f":"$B$166","v":"Persons"},null,null,null,null,"Quality:","High","Standard","Standard"]
[null,null,null,null,null,null,"Price:",99,125,25]
["Calculations",null,"<-- % of target market",null,null,null,"Adjustment factor:"]
["Number of alternatives:",{"$f":"$CF$149","v":3},null,null,null,null,"Potential market share:",{"$f":"CR555*K148","v":0.28160187331783609},{"$f":"CS555*L148","v":0.19571815605050469},0.17778285517817113,0,0.34489711545348806]
["Total market potential:",{"$f":"SUM($H$21:$K$21)/1000","v":148.54719948245975}]
["Total market share:",{"$f":"SUM($H$17:$K$17)","v":0.65510288454651189}]
["Total potential revenue:",{"$f":"SUM($H$22:$K$22)/1000","v":12.876889450260238}]
["Number of filtered respondents:",{"$f":"NSelected","v":400},null,null,null,null,"Potential market (000):",{"$f":"CR554","v":63854.351182312595},{"$f":"CS554","v":44379.874757076133},40312.973543071013,0]
[null,null,null,null,null,null,"Potential revenue ($MM):",{"$f":"H15*H21/1000","v":6321.5807670489467},{"$f":"I15*I21/1000","v":5547.4843446345167},1007.8243385767753,0]
[]
["Segment Inclusion Table",null,{"$f":"BX554","v":0.99999999999999967}]
["Customer segments ***"]
["High fashion:","All",{"$f":"SUMPRODUCT($AW154:$AW553,SegmentInclusionPct)","v":0.32665235954952726}]
["Traditional:","All",{"$f":"SUMPRODUCT($AX154:$AX553,SegmentInclusionPct)","v":0.36397575172517765}]
["Men's shoes:","All",{"$f":"SUMPRODUCT($AY154:$AY553,SegmentInclusionPct)","v":0.30937188872529486}]
["Age ***"]
["< 25:","All",{"$f":"SUMPRODUCT($AK154:$AK553,SegmentInclusionPct)","v":0.12080051509565357}]
["25 - 39:","All",{"$f":"SUMPRODUCT($AL154:$AL553,SegmentInclusionPct)","v":0.25503408980657383}]
["40+:","All",{"$f":"SUMPRODUCT($AM154:$AM553,SegmentInclusionPct)","v":0.62416539509777225}]
["Gender ***"]
["Male:","All",{"$f":"SUMPRODUCT($AN154:$AN553,SegmentInclusionPct)","v":0.4953253305344118}]
["Female:","All",{"$f":"SUMPRODUCT($AO154:$AO553,SegmentInclusionPct)","v":0.50467466946558859}]
[]
[]
[]
[]
[]
[]
[]
[]
[]
[]
[]
[]
[]
[]
[]
[]
[]
[]
[]
[]
[]
[]
[]
[]
[]
[]
[]
[]
[]
[]
[]
[]
[]
[]
[]
[]
[]
[]
[]
[]
[]
[]
[]
[]
[]
[]
[]
[]
[]
[]
[]
[]
[]
[]
[]
[]
[]
[]
[]
[]
[]
[]
[]
[]
[]
[]
[]
[null,"Choose calibration technique",null,null,null,null,"Calibration types"]
[null,"Adjustment factors",null,null,null,null,"Adjustment factors"]
[null,null,null,null,null,null,"Shares adjustment"]
["Calibration step:",1,null,null,null,null,"Weights adjustment",null,null,null,null,null,null,null,null,null,null,null,null,"Variable","Census","Census"]
["Chosen:",null,null,null,null,null,null,null,null,null,null,null,null,null,null,null,null,null,null,"types","tables","variables","AgeValidation","IncomeValidation","GenderValidation"]
[null,null,null,null,null,null,null,null,null,null,null,null,null,null,null,null,null,null,null,"Alternative","HH age income","Age","to","to","Male"]
[null,null,null,null,null,null,null,null,null,null,null,null,null,null,null,null,null,null,null,"Binary","Persons age sex","Income","15-24","0-$2,499","Female"]
[null,null,null,null,null,null,null,null,null,null,null,null,null,null,null,null,null,null,null,"Census","Persons age sex income","Gender","25-29","$2,500-$4,999"]
[null,null,null,null,null,null,null,null,null,null,null,null,null,null,null,null,null,null,null,"Composite","Persons age sex education","Children","30-34","$5,000-$7,499"]
[null,null,null,null,null,null,null,null,null,null,null,null,null,null,null,null,null,null,null,"Constant","Families marital children educa","Marital","35-39","$7,500-$9,999"]
[null,null,null,null,null,null,null,null,null,null,null,null,null,null,null,null,null,null,null,"Discrete","Families marital age","Education","40-44","$10,000-$12,499"]
[null,null,null,null,null,null,null,null,null,null,null,null,null,null,null,null,null,null,null,"Continuous","Business revenue","Revenue","45-49","$12,500-$14,999"]
[null,null,null,null,null,null,null,null,null,null,null,null,null,null,null,null,null,null,null,null,"Business employees","Employees","50-54","$15,000-$17,499"]
[null,null,null,null,null,null,null,null,null,null,null,null,null,null,null,null,null,null,null,null,"UK persons age sex","UKAge","55-59","$17,500-$19,999"]
[null,null,null,null,null,null,null,null,null,null,null,null,null,null,null,null,null,null,null,null,"UK HH children SEL","UKGender","60-64","$20,000-$22,499"]
[null,null,null,null,null,null,null,null,null,null,null,null,null,null,null,null,null,null,null,null,"Australia persons age sex",null,"65-69","$22,500-$24,999"]
[null,null,null,null,null,null,null,null,null,null,null,null,null,null,null,null,null,null,null,null,"France persons age sex",null,"70-74","$25,000-$27,499"]
[null,null,null,null,null,null,null,null,null,null,null,null,null,null,null,null,null,null,null,null,"Germany persons age sex",null,"75+","$27,500-$29,999"]
[null,null,null,null,null,null,null,null,null,null,null,null,null,null,null,null,null,null,null,null,"Italy persons age sex",null,"Ignore","$30,000-$32,499"]
[null,null,null,null,null,null,null,null,null,null,null,null,null,null,null,null,null,null,null,null,"Spain persons age sex",null,null,"$32,500-$34,999"]
[null,null,null,null,null,null,null,null,null,null,null,null,null,null,null,null,null,null,null,null,null,null,null,"$35,000-$37,499"]
[null,null,null,null,null,null,null,null,null,null,null,null,null,null,null,null,null,null,null,null,null,null,null,"$37,500-$39,999"]
[null,null,null,null,null,null,null,null,null,null,null,null,null,null,null,null,null,null,null,null,null,null,null,"$40,000-$42,499"]
[null,null,null,null,null,null,null,null,null,null,null,null,null,null,null,null,null,null,null,null,null,null,null,"$42,500-$44,999"]
[null,null,null,null,null,null,null,null,null,null,null,null,null,null,null,null,null,null,null,null,null,null,null,"$45,000-$47,499"]
[null,null,null,null,null,null,null,null,null,null,null,null,null,null,null,null,null,null,null,null,null,null,null,"$47,500-$49,999"]
[null,null,null,null,null,null,null,null,null,null,null,null,null,null,null,null,null,null,null,null,null,null,null,"$50,000-$52,499"]
[null,null,null,null,null,null,null,null,null,null,null,null,null,null,null,null,null,null,null,null,null,null,null,"$52,500-$54,999"]
[null,null,null,null,null,null,null,null,null,null,null,null,null,null,null,null,null,null,null,null,null,null,null,"$55,000-$57,499"]
[null,null,null,null,null,null,null,null,null,null,null,null,null,null,null,null,null,null,null,null,null,null,null,"$57,500-$59,999"]
[null,null,null,null,null,null,null,null,null,null,null,null,null,null,null,null,null,null,null,null,null,null,null,"$60,000-$62,499"]
[null,null,null,null,null,null,null,null,null,null,null,null,null,null,null,null,null,null,null,null,null,null,null,"$62,500-$64,999"]
[null,null,null,null,null,null,null,null,null,null,null,null,null,null,null,null,null,null,null,null,null,null,null,"$65,000-$67,499"]
[null,null,null,null,null,null,null,null,"Tracking Formulas",null,null,null,null,null,null,null,null,null,null,null,null,null,null,"$67,500-$69,999"]
[null,null,null,null,null,null,null,null,null,null,null,null,null,null,null,null,null,null,null,null,null,null,null,"$70,000-$72,499"]
[null,null,null,null,null,null,null,null,null,"Share from base scenario:",null,null,null,null,null,null,null,null,null,null,null,null,null,"$72,500-$74,999"]
[null,null,null,null,null,null,null,null,null,"Change in share:",{"$f":"K137-K138","v":0},{"$f":"L137-L138","v":0},0,0,0,null,null,null,null,null,null,null,null,"$75,000-$77,499"]
[null,null,null,null,null,null,null,null,null,null,null,null,null,null,null,null,null,null,null,null,null,null,null,"$77,500-$79,999"]
[null,null,null,null,null,null,null,null,null,null,null,null,null,null,null,null,null,null,null,null,null,null,null,"$80,000-$82,499"]
[null,null,null,null,null,null,null,null,"Calibration Formulas",null,null,null,null,null,null,null,null,null,null,null,null,null,null,"$82,500-$84,999"]
[null,null,null,null,null,null,null,null,null,null,null,null,null,null,null,null,null,null,null,null,null,null,null,"$85,000-$87,499",null,null,null,null,null,null,null,null,null,null,null,null,null,null,null,null,null,null,null,null,null,null,null,null,null,null,null,null,null,null,null,null,null,null,null,null,null,null,null,null,null,null,null,null,null,null,null,null,null,null,null,null,null,null,"Common representative value:"]
[null,null,null,null,null,null,null,null,null,"Target market share:",null,null,null,null,null,{"$f":"SUM(K144:O144)","v":0},null,null,null,null,null,null,null,"$87,500-$89,999"]
[null,null,null,null,null,null,null,null,null,"Absolute difference:",{"$f":"ABS(K143-K144)","v":0},{"$f":"ABS(L143-L144)","v":0},0,0,0,null,null,null,null,null,null,null,null,"$90,000-$92,499"]
[null,null,null,null,null,null,null,null,null,"Sum of squared differences:",{"$f":"SUMPRODUCT(K145:O145,K145:O145)","v":0},null,null,null,null,null,null,null,null,null,null,null,null,"$92,500-$94,999"]
[null,null,null,null,null,null,null,null,null,null,null,null,null,null,null,null,null,null,null,null,null,null,null,"$95,000-$97,499",null,null,null,null,null,null,null,null,null,null,null,"All","Any age:",{"$f":"PRODUCT($AK$149:$AM$149)","v":1},null,"Any gender:",{"$f":"PRODUCT($AN$149:$AO$149)","v":1},null,null,null,null,null,null,null,"Any class:",{"$f":"PRODUCT($AW$149:$AY$149)","v":1}]
[null,null,null,null,null,null,null,null,null,"Share adjustment ratios:",1,1,1,1,1,null,null,null,null,null,null,null,null,"$97,500-$99,999",null,null,null,null,null,null,null,null,null,null,null,"Only",{"$f":"IF(B30=AJ149,0,1)","v":1},{"$f":"IF(B31=AJ149,0,1)","v":1},{"$f":"IF(B32=AJ149,0,1)","v":1},{"$f":"IF(B34=AJ149,0,1)","v":1},{"$f":"IF(B35=AJ149,0,1)","v":1},null,null,null,null,null,null,null,{"$f":"IF(B26=AJ149,0,1)","v":1},{"$f":"IF(B27=AJ149,0,1)","v":1},{"$f":"IF(B28=AJ149,0,1)","v":1},null,null,null,null,null,null,null,null,null,null,null,null,null,null,null,null,null,null,null,null,null,null,null,null,null,null,null,null,{"$f":"(H11)","v":"Your prod."},{"$f":"(I11)","v":"B"},"C","D","Total","Any?",null,"Overflow trigger"]
[null,null,null,null,null,null,null,null,null,null,null,null,null,null,null,null,null,null,null,null,null,null,null,"$100,000+",null,null,null,null,null,null,null,null,null,null,null,"Exclude",{"$f":"IF(B30=AJ148,0,1)","v":1},{"$f":"IF(B31=AJ148,0,1)","v":1},{"$f":"IF(B32=AJ148,0,1)","v":1},{"$f":"IF(B34=AJ148,0,1)","v":1},{"$f":"IF(B35=AJ148,0,1)","v":1},null,null,null,null,null,null,null,{"$f":"IF(B26=AJ148,0,1)","v":1},{"$f":"IF(B27=AJ148,0,1)","v":1},{"$f":"IF(B28=AJ148,0,1)","v":1},null,null,null,null,null,null,null,null,null,null,null,null,null,null,null,null,null,null,null,null,null,null,null,null,null,null,null,"Alternative:",{"$f":"IF(H12=\"\",0,1)","v":1},{"$f":"IF(I12=\"\",0,1)","v":1},1,0,{"$f":"SUM($CB$149:$CE$149)","v":3},{"$f":"IF(OR($CB$149:$CE$149),1,0)","v":1},null,700]
[null,null,null,null,null,null,null,null,null,null,null,null,null,null,null,null,null,null,null,null,null,null,null,"Ignore",null,null,null,null,null,null,null,null,null,null,null,null,"Landing zone for demographic data"]
[null,null,null,null,null,null,null,null,null,null,null,null,null,null,null,null,null,null,null,null,null,null,null,null,null,null,null,null,null,null,null,null,null,null,null,"Category:","Age","Age","Age","Gender","Gender",null,null,null,null,null,null,null,"Class","Class","Class",null,null,"Reweightings to known age and gender distributions",null,null,null,null,null,null,null,null,null,null,null,null,null,null,null,null,null,null,null,null,"Segment","Segment"]
[null,null,null,null,null,null,null,null,null,null,"Coefficients",null,null,null,null,null,null,null,null,null,null,null,null,null,null,null,null,null,"Coefficients",null,null,null,null,null,null,"Census:","Age","Age","Age","Gender","Gender",null,null,null,"Posterior probability",null,null,null,"Modal membership",null,null,null,null,"Sample","Population",null,"Revised",null,null,null,null,null,null,null,null,"Segment translation table",null,null,null,null,null,null,null,null,"inclusion","inclusion",null,null,null,"Individual representative value",null,null,null,null,"Numerator",null,null,null,null,"Denom-","Purchase probability",null,null,null,null,"Potential market"]
["Parameters",null,null,null,null,null,null,null,null,"Variable","Class 1","Class 2","Class 3","Wald","P value","Wald(=)","P value","Source","Sheet","Var type","Long name","Census name","Based on (1)","Based on (2)","Based on (3)","Based on (4)","Based on (5)",null,"ID","Fashion: Traditional","Fashion: Modern","Quality: Standard","Quality: High","Price","None","ID","< 25","25 - 39","40+","Male","Female","Count","Percentage",null,"Modal","Class 1","Class 2","Class 3","Class1","Class2","Class3",null,null,"percentage","percentage","Ratio","percentage",null,null,null,null,null,null,null,null,{"$f":"AK153","v":"< 25"},{"$f":"AL153","v":"25 - 39"},"40+","Male","Female",{"$f":"AW153","v":"Class1"},{"$f":"AX153","v":"Class2"},"Class3",null,"flags","percentage",null,null,null,{"$f":"CB148","v":"Your prod."},{"$f":"CC148","v":"B"},"C","D","None",{"$f":"CB153","v":"Your prod."},{"$f":"CC153","v":"B"},"C","D","None","inator",{"$f":"CG153","v":"Your prod."},{"$f":"CH153","v":"B"},"C","D","None",{"$f":"CM153","v":"Your prod."},{"$f":"CN153","v":"B"},"C","D","None"]
["Steps Completed:",7,null,null,null,null,null,null,null,"None",-0.29849999999999999,-1.2810999999999999,-1.2484,149.05029999999999,4.1999999999999998E-32,86.485699999999994,1.7000000000000001E-19,"Design","Summary","None","None",null,"None",null,null,null,null,null,6,-1.0088042088453044,1.0088042088453044,1.6676722881539981E-2,-1.6676722881539981E-2,-1.4804186264827487E-2,-0.5578075591848155,6,1,0,0,1,0,1,{"$f":"AP154/$AP$554","v":2.5000000000000001E-3},null,1,0.67035368128440609,1.1809779170214729E-4,0.32952822082389177,{"$f":"IF($AS154= 1,1,0)","v":1},{"$f":"IF($AS154= 2,1,0)","v":0},{"$f":"IF($AS154= 3,1,0)","v":0},null,null,{"$f":"SUM($AQ$154:$AQ$221)","v":0.1700000000000001},{"$f":"Assumptions!S56","v":6.1546874586556354E-2},{"$f":"$BC$154/$BB$154","v":0.36204043874444891},{"$f":"AQ154*BD154","v":9.0510109686112227E-4},null,null,null,null,null,null,null,null,{"$f":"INDEX(AK$148:AK$149,2-AK154)","v":1},{"$f":"INDEX(AL$148:AL$149,2-AL154)","v":1},{"$f":"INDEX(AM$148:AM$149,2-AM154)","v":1},{"$f":"INDEX(AN$148:AN$149,2-AN154)","v":1},{"$f":"INDEX(AO$148:AO$149,2-AO154)","v":1},{"$f":"INDEX(AW$148:AW$149,2-AW154)","v":1},{"$f":"INDEX(AX$148:AX$149,2-AX154)","v":1},{"$f":"INDEX(AY$148:AY$149,2-AY154)","v":1},null,{"$f":"IF(AND(BN154:BU154),1,0)","v":1},{"$f":"BE154*BW154","v":9.0510109686112227E-4},null,null,null,{"$f":"CB$149*(H$16+($BW154*MMULT($AD154:$AH154,CC$3:CC$7)))","v":-2.4910953719447653},{"$f":"CC$149*(I$16+($BW154*MMULT($AD154:$AH154,CD$3:CD$7)))","v":-0.82504235137659165},-1.3622321425844515,0,{"$f":"IF($CG$149=0,0,$L$16+$AI154)","v":-0.5578075591848155},{"$f":"$BW154*IF(CB$149=0,0,IF(ABS(CB154)>OverflowTrigger,OverflowTrigger,EXP(CB154)))","v":8.281919904502337E-2},{"$f":"$BW154*IF(CC$149=0,0,IF(ABS(CC154)>OverflowTrigger,OverflowTrigger,EXP(CC154)))","v":0.43821643300275986},{"$f":"$BW154*IF(CD$149=0,0,IF(ABS(CD154)>OverflowTrigger,OverflowTrigger,EXP(CD154)))","v":0.25608851242917374},{"$f":"$BW154*IF(CE$149=0,0,IF(ABS(CE154)>OverflowTrigger,OverflowTrigger,EXP(CE154)))","v":0},{"$f":"IF(L$12=\"\",0,$BW154*IF($CG$149=0,0,IF(ABS(CF154)>OverflowTrigger,OverflowTrigger,EXP(CF154))))","v":0.57246277976117244},{"$f":"IF($CG$149=0,0,SUM(CG154:CK154))","v":1.3495869242381295},{"$f":"IF($CL154=0,0,CG154/$CL154)","v":6.1366331843928146E-2},{"$f":"IF($CL154=0,0,CH154/$CL154)","v":0.32470411881779482},{"$f":"IF($CL154=0,0,CI154/$CL154)","v":0.18975325548129562},{"$f":"IF($CL154=0,0,CJ154/$CL154)","v":0},{"$f":"IF($CL154=0,0,CK154/$CL154)","v":0.42417629385698136},{"$f":"CM154*$BX154*TargetMarketSize","v":12.594537164909715},{"$f":"CN154*$BX154*TargetMarketSize","v":66.640745326781499},{"$f":"CO154*$BX154*TargetMarketSize","v":38.944065198484701},{"$f":"CP154*$BX154*TargetMarketSize","v":0},{"$f":"CQ154*$BX154*TargetMarketSize","v":87.055946427471}]
["Stat File Path:","C:\\Users\\George\\Documents\\StatWizards\\Simulator Wizard\\Tutorial files\\Latent GOLD tutorial",null,null,null,null,null,null,null,"Traditional",-1.5458000000000001,2.3199999999999998E-2,-0.52180000000000004,592.08709999999996,5.1999999999999996E-128,377.39530000000002,1.0999999999999999E-82,"Design","Summary","Discrete","Fashion: Traditional",null,"Fashion","Fashion",null,null,null,null,8,-5.5762108541727883E-4,5.5762108541727883E-4,-1.2315171725478182,1.2315171725478182,-1.4804186264827487E-2,-1.132037142859619,8,1,0,0,1,0,1,{"$f":"AP155/$AP$554","v":2.5000000000000001E-3},null,2,2.6309495939262878E-7,0.97812228205209595,2.1877454752944645E-2,0,1,0,null,null,null,null,0.36204043874444891,9.0510109686112227E-4,null,null,null,null,null,null,null,null,1,1,1,1,1,1,1,1,null,{"$f":"IF(AND(BN155:BU155),1,0)","v":1},{"$f":"BE155*BW155","v":9.0510109686112227E-4},null,null,null,{"$f":"CB$149*(H$16+($BW155*MMULT($AD155:$AH155,CC$3:CC$7)))","v":-0.23465488875552021},-3.0814828345658372,-1.6021794502539226,0,{"$f":"IF($CG$149=0,0,$L$16+$AI155)","v":-1.132037142859619},0.79084373160311083,4.5891157177268244E-2,0.20145697373365787,0,0.32237586136168611,{"$f":"IF($CG$149=0,0,SUM(CG155:CK155))","v":1.360567723875723},{"$f":"IF($CL155=0,0,CG155/$CL155)","v":0.58126010026925212},3.3729417780500016E-2,0.14806831751071242,0,0.23694216443953553,119.29508763761289,6.9224669785979103,30.388844693816196,0,48.628894807619936]
["Stat File:","Latent GOLD shoe model processed by Format Wizard.xlsm",null,null,null,null,null,null,null,"Modern",1.5458000000000001,-2.3199999999999998E-2,0.52180000000000004,null,null,null,null,"Design","Summary","Discrete","Fashion: Modern",null,"Fashion","Fashion",null,null,null,null,37,-3.7360643461087331E-3,3.7360643461087331E-3,-1.2233957008307783,1.2233957008307783,-1.4804186264827487E-2,-1.1313092234653177,37,1,0,0,1,0,1,2.5000000000000001E-3,null,2,1.1935354752527347E-4,0.83475374830155002,0.1651268980509247,0,1,0,null,null,null,null,0.36204043874444891,9.0510109686112227E-4,null,null,null,null,null,null,null,null,1,1,1,1,1,1,1,1,null,1,9.0510109686112227E-4,null,null,null,{"$f":"CB$149*(H$16+($BW156*MMULT($AD156:$AH156,CC$3:CC$7)))","v":-0.24595480373325151},-3.0701829195881056,-1.5972364217975741,0,-1.1313092234653177,0.78195756568956087,4.6412664295474075E-2,0.2024552465002897,0,0.32261061043226102,1.3534360869175857,0.57775728994373743,3.4292468439479598E-2,0.14958611526413196,0,0.23836412635265108,118.57618733021756,7.038024846196719,30.700350362150353,0,48.9207315790823]
["Stat File Type:","LatentGOLDChoice",null,null,null,null,null,null,null,"Standard",1.2500000000000001E-2,-1.3900999999999999,-0.46829999999999999,310.28620000000001,5.9E-67,245.11269999999999,5.9000000000000002E-54,"Design","Summary","Discrete","Quality: Standard",null,"Quality","Quality",null,null,null,null,39,-1.2117026270068829E-4,1.2117026270068829E-4,-1.2326694201104618,1.2326694201104618,-1.4804186264827488E-2,-1.1321275222310998,39,1,0,0,1,0,1,2.5000000000000001E-3,null,2,3.7123058771596834E-7,0.98958364820861233,1.0415980460799985E-2,0,1,0,null,null,null,null,0.36204043874444891,9.0510109686112227E-4,null,null,null,null,null,null,null,null,1,1,1,1,1,1,1,1,null,1,9.0510109686112227E-4,null,null,null,{"$f":"CB$149*(H$16+($BW157*MMULT($AD157:$AH157,CC$3:CC$7)))","v":-0.2330661903701603},-3.0830715329511973,-1.6028952469938496,0,-1.1321275222310998,0.79210114232129814,4.5818307853082677E-2,0.20131282308606038,0,0.32234672655056845,1.3615789998110097,0.58175187956867991,3.3650862608370399E-2,0.14785247357222978,0,0.23674478425071988,119.39601810677193,6.906344684741426,30.344545899618197,0,48.588385426515352]
["Data Path:",null,null,null,null,null,null,null,null,"High",-1.2500000000000001E-2,1.3900999999999999,0.46829999999999999,null,null,null,null,"Design","Summary","Discrete","Quality: High",null,"Quality","Quality",null,null,null,null,62,-8.7290997674238854E-3,8.7290997674238854E-3,-1.2105238518932053,1.2105238518932053,-1.4804186264827487E-2,-1.1301951447916629,62,1,0,0,1,0,1,2.5000000000000001E-3,null,2,2.4914104381234923E-4,0.77024782861784624,0.22950303023834143,0,1,0,null,null,null,null,0.36204043874444891,9.0510109686112227E-4,null,null,null,null,null,null,null,null,1,1,1,1,1,1,1,1,null,1,9.0510109686112227E-4,null,null,null,{"$f":"CB$149*(H$16+($BW158*MMULT($AD158:$AH158,CC$3:CC$7)))","v":-0.26381968809213974},-3.0523180352292174,-1.5893576082813163,0,-1.1301951447916629,0.76811202691590363,4.7249271874282475E-2,0.20405665394412781,0,0.32297022431512196,1.3423881770494359,0.57219814659289603,3.5197920156102833E-2,0.1520101692139777,0,0.24059376403702337,117.43525490956547,7.223855495567217,31.197851787503989,0,49.378331925010237]
["Data Workbook:",null,null,null,null,null,null,null,null,"Price",-1.7299999999999999E-2,-1.7299999999999999E-2,-1.7299999999999999E-2,144.20480000000001,3.1999999999999998E-33,0,null,"Design","Summary","Continuous","Price",null,"Price",null,null,"Price",null,null,64,-7.8735557993336383E-3,7.8735557993336383E-3,-1.2122695399589971,1.2122695399589971,-1.4804186264827487E-2,-1.1305049236556748,64,1,0,0,1,0,1,2.5000000000000001E-3,null,2,2.7575229247457592E-5,0.86885095210799568,0.13112147256275691,0,1,0,null,null,null,null,0.36204043874444891,9.0510109686112227E-4,null,null,null,null,null,null,null,null,1,1,1,1,1,1,1,1,null,1,9.0510109686112227E-4,null,null,null,{"$f":"CB$149*(H$16+($BW159*MMULT($AD159:$AH159,CC$3:CC$7)))","v":-0.26121845605825778},-3.0549192672630996,-1.5902477523790179,0,-1.1305049236556748,0.77011266546036772,4.7126525270117674E-2,0.20387509493685035,0,0.32287019046091076,1.3439844761282465,0.57300711365276336,3.5064783936998939E-2,0.15169453111852466,0,0.24023357129171308,117.60128350202881,7.1965312444817195,31.13307171014895,0,49.30440766098743]
["Design Type:","Internal",null,null,null,null,null,null,null,"Intercept",0.3659,5.6599999999999998E-2,-0.4224,7.5361000000000002,2.3E-2,null,null,"Model","Parameters","Intercept","Intercept",null,"Intercept",null,null,null,null,null,72,-8.7290997674238976E-3,8.7290997674238976E-3,-1.2105238518932053,1.2105238518932053,-1.4804186264827487E-2,-1.1301951447916629,72,1,0,0,1,0,1,2.5000000000000001E-3,null,2,2.4914104381234913E-4,0.77024782861784713,0.22950303023834048,0,1,0,null,null,null,null,0.36204043874444891,9.0510109686112227E-4,null,null,null,null,null,null,null,null,1,1,1,1,1,1,1,1,null,1,9.0510109686112227E-4,null,null,null,{"$f":"CB$149*(H$16+($BW160*MMULT($AD160:$AH160,CC$3:CC$7)))","v":-0.26381968809213974},-3.0523180352292174,-1.5893576082813163,0,-1.1301951447916629,0.76811202691590363,4.7249271874282475E-2,0.20405665394412781,0,0.32297022431512196,1.3423881770494359,0.57219814659289603,3.5197920156102833E-2,0.1520101692139777,0,0.24059376403702337,117.43525490956547,7.223855495567217,31.197851787503989,0,49.378331925010237]
["Design Path:",null,null,null,null,null,null,null,null,"Male",-0.70309999999999995,-0.34410000000000002,1.0471999999999999,24.779199999999999,4.1999999999999996E-6,null,null,"Data","Parameters","Census","Gender: Male","Gender","Gender","Male",null,null,null,null,77,-1.8613689221123305E-5,1.8613689221123305E-5,-1.2329390360711736,1.2329390360711736,-1.4804186264827487E-2,-1.1321490535007726,77,1,0,0,1,0,1,2.5000000000000001E-3,null,2,7.0488311357833778E-10,0.99881129091927956,1.1887082758373106E-3,0,1,0,null,null,null,null,0.36204043874444891,9.0510109686112227E-4,null,null,null,null,null,null,null,null,1,1,1,1,1,1,1,1,null,1,9.0510109686112227E-4,null,null,null,{"$f":"CB$149*(H$16+($BW161*MMULT($AD161:$AH161,CC$3:CC$7)))","v":-0.23269401783596866},-3.0834437054853883,-1.6030623063810818,0,-1.1321490535007726,0.79239599547549133,4.5801258710144808E-2,0.20127919469824077,0,0.32233978609098968,1.3618162349748668,0.58186705013846118,3.3632481045425412E-2,0.147802023157666,0,0.23669844565844719,119.41965517253468,6.9025721392640689,30.334191693946845,0,48.578875111901276]
["Design File:",null,null,null,null,null,null,null,null,"Female",0.70309999999999995,0.34410000000000002,-1.0471999999999999,null,null,null,null,"Data","Parameters","Census","Gender: Female","Gender","Gender","Female",null,null,null,null,78,-3.6707329607533673E-2,3.6707329607533673E-2,-1.136443620252124,1.136443620252124,-1.4804186264827487E-2,-1.1244574605762365,78,1,0,0,1,0,1,2.5000000000000001E-3,null,2,1.4198822989542251E-4,0.61222268182484296,0.38763532984526161,0,1,0,null,null,null,null,0.36204043874444891,9.0510109686112227E-4,null,null,null,null,null,null,null,null,1,1,1,1,1,1,1,1,null,1,9.0510109686112227E-4,null,null,null,{"$f":"CB$149*(H$16+($BW162*MMULT($AD162:$AH162,CC$3:CC$7)))","v":-0.36587814957333098},-2.9502595737480259,-1.5432556064803449,0,-1.1244574605762365,0.69358730997058904,5.2326121697922466E-2,0.21368429580181514,0,0.32482865191012467,1.2844263793804513,0.53999771501512128,4.0738903013781295E-2,0.16636554592166403,0,0.25289783604943333,110.8265898639857,8.361060742063696,34.14408174827561,0,51.903561763321903]
["Created By:","Simulator Builder",null,null,null,null,null,null,null,"< 25",1.0463,-0.16370000000000001,-0.88270000000000004,63.389400000000002,5.6000000000000004E-13,null,null,"Data","Parameters","Census","Age: < 25","Age","Age","15-24",null,null,null,null,93,-2.8688372475162534E-4,2.8688372475162534E-4,-1.2322332994478,1.2322332994478,-1.4804186264827487E-2,-1.1320928525820824,93,1,0,0,1,0,1,2.5000000000000001E-3,null,2,8.3540546828617316E-7,0.98439234630552708,1.5606818189004664E-2,0,1,0,null,null,null,null,0.36204043874444891,9.0510109686112227E-4,null,null,null,null,null,null,null,null,1,1,1,1,1,1,1,1,null,1,9.0510109686112227E-4,null,null,null,{"$f":"CB$149*(H$16+($BW163*MMULT($AD163:$AH163,CC$3:CC$7)))","v":-0.23366802449487278},-3.0824696988264844,-1.6026248397932388,0,-1.1320928525820824,0.79162457224607707,4.5845891173744518E-2,0.20136726688366385,0,0.32235790239216999,1.3611956326956554,0.58156561278291541,3.3680604075222616E-2,0.14793411178148175,0,0.23681967136038026,119.3577895882112,6.9124486834383312,30.361300941505267,0,48.603754904492128]
["Version:",18.899999999999999,null,null,null,null,null,null,null,"25 - 39",-0.60140000000000005,-0.3352,0.93669999999999998,null,null,null,null,"Data","Parameters","Census","Age: 25 - 39","Age","Age","25-29","30-34","35-39",null,null,98,-0.47403645247792242,0.47403645247792242,-1.6499976409318627E-2,1.6499976409318627E-2,-1.4804186264827487E-2,-1.0249456699721442,98,1,0,0,1,0,1,2.5000000000000001E-3,null,3,2.811655294999512E-2,8.5052810569123463E-3,0.96337816589309255,0,0,1,null,null,null,null,0.36204043874444891,9.0510109686112227E-4,null,null,null,null,null,null,null,null,1,1,1,1,1,1,1,1,null,1,9.0510109686112227E-4,null,null,null,{"$f":"CB$149*(H$16+($BW164*MMULT($AD164:$AH164,CC$3:CC$7)))","v":-1.923150916286525},-1.3929868070348321,-0.86064108550792817,0,-1.0249456699721442,0.14614574287887375,0.2483324746567219,0.42289088617851578,0,0.35881595935746036,1.1761850630715718,0.12425403745327164,0.21113384487999629,0.35954451340688598,0,0.30506760425984608,25.501313922027322,43.332116752135676,73.791223957448494,0,62.610639486035424]
["Alternative Count:",4,null,null,null,null,null,null,null,"40+",-0.44490000000000002,0.49890000000000001,-5.3999999999999999E-2,null,null,null,null,"Data","Parameters","Census","Age: 40+","Age","Age","40-44","45-49","to","75+",null,103,-0.15240514816524939,0.15240514816524939,-0.84428210728603048,0.84428210728603048,-1.4804186264827488E-2,-1.0970645018809853,103,1,0,0,1,0,1,2.5000000000000001E-3,null,3,2.7582589044800282E-3,0.15969160036432239,0.83755014063119759,0,0,1,null,null,null,null,0.36204043874444891,9.0510109686112227E-4,null,null,null,null,null,null,null,null,1,1,1,1,1,1,1,1,null,1,9.0510109686112227E-4,null,null,null,{"$f":"CB$149*(H$16+($BW165*MMULT($AD165:$AH165,CC$3:CC$7)))","v":-0.77373748109714036},-2.5424002422242173,-1.3667919120719672,0,-1.0970645018809853,0.46128579555597721,7.8677328327252924E-2,0.25492346603418525,0,0.33384966174244129,1.1287362516598567,0.40867456403356939,6.9703908429940495E-2,0.22584856795315025,0,0.29577295958333982,83.874444347830746,14.305702147768365,46.352097269914161,0,60.703050352133637]
["Unit Of Measurement:",{"$f":"IF(CensusTable=\"\",\"Persons\",IF(ISERR(FIND(\"ersons\",CensusTable)),IF(ISERR(FIND(\"HH\",CensusTable)),IF(ISERR(FIND(\"Families\",CensusTable)),IF(ISERR(FIND(\"Business\",CensusTable)),\"\",\"Businesses\"),\"Families\"),\"Households\"),\"Persons\"))","v":"Persons"},null,null,null,null,null,null,null,null,null,null,null,null,null,null,null,null,null,null,null,null,null,null,null,null,null,null,105,-1.4898398199552998,1.4898398199552998,3.2540951151560631E-2,-3.2540951151560631E-2,-1.4804186264827487E-2,-0.13399253750380741,105,1,0,0,1,0,1,2.5000000000000001E-3,null,1,0.97577229117977271,1.7268986071482559E-5,2.4210439734155834E-2,1,0,0,null,null,null,null,0.36204043874444891,9.0510109686112227E-4,null,null,null,null,null,null,null,null,1,1,1,1,1,1,1,1,null,1,9.0510109686112227E-4,null,null,null,{"$f":"CB$149*(H$16+($BW166*MMULT($AD166:$AH166,CC$3:CC$7)))","v":-2.9879952113247814},-0.32814251199657551,-1.8274035254244263,0,-0.13399253750380741,5.0388353531878087E-2,0.72026036664792381,0.16083061872226651,0,0.87459659125271372,1.806075930154782,2.7899354999742325E-2,0.39879849712973975,8.9049754795460456E-2,0,0.48425239307505757,5.7259323290647588,81.847526852097715,18.276152616550664,0,99.385682319933807]
["Census Table:","Persons age sex",null,null,null,null,null,null,null,"Other Composite Vars","Class 1","Class 2","Class 3","Wald","P value","Wald(=)","P value","Source","Sheet","Var type","Long name","Census name","Based on (1)","Based on (2)","Based on (3)","Based on (4)","Based on (5)",null,107,-1.4841839195483804,1.4841839195483804,3.2206406230210871E-2,-3.2206406230210871E-2,-1.4804186264827487E-2,-0.1389373871258055,107,1,0,0,1,0,1,2.5000000000000001E-3,null,1,0.97197688171982055,5.5565538786142621E-5,2.796755264139333E-2,1,0,0,null,null,null,null,0.36204043874444891,9.0510109686112227E-4,null,null,null,null,null,null,null,null,1,1,1,1,1,1,1,1,null,1,9.0510109686112227E-4,null,null,null,{"$f":"CB$149*(H$16+($BW167*MMULT($AD167:$AH167,CC$3:CC$7)))","v":-2.9820047659965123},-0.33413295732484483,-1.8220821699388567,0,-0.1389373871258055,5.0691108120926275E-2,0.71595858396067225,0.16168873676810649,0,0.87028251764216236,1.7986209464918672,2.8183319125576235E-2,0.39805973868875411,8.9895948939921672E-2,0,0.48386099324574805,5.7842117899491425,81.695907546180123,18.449821520669794,0,99.305353260847866]
["Currency Symbol:",{"$f":"IF(ISERR(FIND(\"UK\",CensusTable)),IF(ISERR(FIND(\"Germany\",CensusTable)),IF(ISERR(FIND(\"France\",CensusTable)),IF(ISERR(FIND(\"Italy\",CensusTable)),IF(ISERR(FIND(\"Spain\",CensusTable)),\"$\",\"€\"),\"€\"),\"€\"),\"€\"),\"£\")","v":"$"},null,null,null,null,null,null,null,null,null,null,null,null,null,null,null,null,null,null,null,null,null,null,null,null,null,null,110,-0.98598836594095207,0.98598836594095207,9.2098562910159186E-3,-9.2098562910159186E-3,-1.4804186264827487E-2,-0.57617360147316332,110,1,0,0,1,0,1,2.5000000000000001E-3,null,3,0.43690530083957962,1.2724244753314143E-3,0.56182227458508893,0,0,1,null,null,null,null,0.36204043874444891,9.0510109686112227E-4,null,null,null,null,null,null,null,null,1,1,1,1,1,1,1,1,null,1,9.0510109686112227E-4,null,null,null,{"$f":"CB$149*(H$16+($BW168*MMULT($AD168:$AH168,CC$3:CC$7)))","v":-2.4608126624498894},-0.85532506087146798,-1.3468831662706233,0,-0.57617360147316332,8.5365549394607512E-2,0.42514497062380868,0.26004952995808178,0,0.56204486491049443,1.3326049148869923,6.4059158450459938E-2,0.31903302012049228,0.19514375720288749,0,0.42176406422616042,13.147200225509092,65.476835717670397,40.05038640475729,0,86.560871769710147]
["None Alternative:",true,null,null,null,null,null,null,null,null,null,null,null,null,null,null,null,null,null,null,null,null,null,null,null,null,null,null,111,-1.4167789942853311,1.4167789942853311,3.0292781542977217E-2,-3.0292781542977217E-2,-1.4804186264827487E-2,-0.19840427051163048,111,1,0,0,1,0,1,2.5000000000000001E-3,null,1,0.96487334208864717,1.0089280980452992E-6,3.512564888325477E-2,1,0,0,null,null,null,null,0.36204043874444891,9.0510109686112227E-4,null,null,null,null,null,null,null,null,1,1,1,1,1,1,1,1,null,1,9.0510109686112227E-4,null,null,null,{"$f":"CB$149*(H$16+($BW169*MMULT($AD169:$AH169,CC$3:CC$7)))","v":-2.9126862160462297},-0.40345150727512769,-1.756590869363041,0,-0.19840427051163048,5.4329592655423663E-2,0.66801041965906649,0.17263238814379644,0,0.82003826882697228,1.7150106692852589,3.1678865693626178E-2,0.38950802558998882,0.1006596584123538,0,0.47815345030403117,6.5016213179448039,79.940794193145294,20.658914600041303,0,98.133964006515498]
["None Count:",1,null,null,null,null,null,null,null,null,null,null,null,null,null,null,null,null,null,null,null,null,null,null,null,null,null,null,114,-1.4938885307423599,1.4938885307423599,3.2761046898824052E-2,-3.2761046898824052E-2,-1.4804186264827487E-2,-0.13044781300074682,114,1,0,0,1,0,1,2.5000000000000001E-3,null,1,0.9945837271607868,1.4570810351619564E-7,5.4161270311097178E-3,1,0,0,null,null,null,null,0.36204043874444891,9.0510109686112227E-4,null,null,null,null,null,null,null,null,1,1,1,1,1,1,1,1,null,1,9.0510109686112227E-4,null,null,null,{"$f":"CB$149*(H$16+($BW170*MMULT($AD170:$AH170,CC$3:CC$7)))","v":-2.9922640178591049},-0.32387370546225203,-1.8312321404642231,0,-0.13044781300074682,5.0173713852642965E-2,0.72334159070315562,0.16021603744485341,0,0.87770229640264263,1.8114336384032945,2.7698344995331466E-2,0.3993199504348125,8.8447091876949671E-2,0,0.48453461269290643,5.6846779816889068,81.95454747453293,18.152464915216306,0,99.443603746208794]
["Latent Classes:",3,null,null,null,null,null,null,null,null,null,null,null,null,null,null,null,null,null,null,null,null,null,null,null,null,null,null,116,-1.4914042808073238,1.4914042808073238,3.2483239114009188E-2,-3.2483239114009188E-2,-1.4804186264827487E-2,-0.13258591616075915,116,1,0,0,1,0,1,2.5000000000000001E-3,null,1,0.96403718479699518,3.8596683309600174E-5,3.5924218419695238E-2,1,0,0,null,null,null,null,0.36204043874444891,9.0510109686112227E-4,null,null,null,null,null,null,null,null,1,1,1,1,1,1,1,1,null,1,9.0510109686112227E-4,null,null,null,{"$f":"CB$149*(H$16+($BW171*MMULT($AD171:$AH171,CC$3:CC$7)))","v":-2.9895019601392541},-0.32663576318210308,-1.8290256983140019,0,-0.13258591616075915,5.0312488109351482E-2,0.72134643611294691,0.16056993514684054,0,0.87582768312159121,1.8080565424907302,2.7826833357789987E-2,0.39896232178626417,8.8808027499872155E-2,0,0.48440281735607366,5.7110483285487765,81.881149453663213,18.226541643944337,0,99.416554691490575]
["A S Constants Used:",false,null,null,null,null,null,null,null,null,null,null,null,null,null,null,null,null,null,null,null,null,null,null,null,null,null,null,121,-0.98551644239629277,0.98551644239629277,1.6271867099380392E-2,-1.6271867099380392E-2,-1.4804186264827487E-2,-0.57841906057948633,121,1,0,0,1,0,1,2.5000000000000001E-3,null,1,0.75336357917699026,5.8668442114398885E-5,0.24657775228089532,1,0,0,null,null,null,null,0.36204043874444891,9.0510109686112227E-4,null,null,null,null,null,null,null,null,1,1,1,1,1,1,1,1,null,1,9.0510109686112227E-4,null,null,null,{"$f":"CB$149*(H$16+($BW172*MMULT($AD172:$AH172,CC$3:CC$7)))","v":-2.4674027497135942},-0.84873497360776273,-1.3393492319175995,0,-0.57841906057948633,8.4804832590408954E-2,0.42795596525663399,0.26201612484168441,0,0.5607842320298948,1.3355611547186221,6.3497528578746174E-2,0.32043157570481773,0.19618429595377557,0,0.41988659976266052,13.031933953602662,65.763868684359309,40.263941681336618,0,86.175549798348328]
["Number of products in marketplace:",4,null,null,null,null,null,null,null,null,null,null,null,null,null,null,null,null,null,null,null,null,null,null,null,null,null,null,122,-0.21205604250730334,0.21205604250730334,-0.76707443785899121,0.76707443785899121,-1.4804186264827487E-2,-1.0639601724065471,122,1,0,0,1,0,1,2.5000000000000001E-3,null,3,1.8337258075635354E-2,0.14874209309600081,0.8329206487283638,0,0,1,null,null,null,null,0.36204043874444891,9.0510109686112227E-4,null,null,null,null,null,null,null,null,1,1,1,1,1,1,1,1,null,1,9.0510109686112227E-4,null,null,null,{"$f":"CB$149*(H$16+($BW173*MMULT($AD173:$AH173,CC$3:CC$7)))","v":-0.91059604486623336},-2.4055416784551236,-1.3492351369869817,0,-1.0639601724065471,0.40228437302444847,9.0216613975830612E-2,0.25943861978185773,0,0.34508649873447061,1.0970261055166075,0.36670446674102269,8.2237435847842599E-2,0.23649265817579049,0,0.31456543923534414,75.260699085848671,16.878024333713096,48.536640257372497,0,64.559930440712648]
["Skip Weighting:",false,null,null,null,null,null,null,null,null,null,null,null,null,null,null,null,null,null,null,null,null,null,null,null,null,null,null,125,-1.4912056541372154,1.4912056541372154,3.2669366451961293E-2,-3.2669366451961293E-2,-1.4804186264827487E-2,-0.13281072609474853,125,1,0,0,1,0,1,2.5000000000000001E-3,null,1,0.99060320138785152,1.0605011965629673E-6,9.3957380109519137E-3,1,0,0,null,null,null,null,0.36204043874444891,9.0510109686112227E-4,null,null,null,null,null,null,null,null,1,1,1,1,1,1,1,1,null,1,9.0510109686112227E-4,null,null,null,{"$f":"CB$149*(H$16+($BW174*MMULT($AD174:$AH174,CC$3:CC$7)))","v":-2.9894894608070981},-0.32664826251425927,-1.8286409443059413,0,-0.13281072609474853,5.0313116985782211E-2,0.72133741982059119,0.16063172695952382,0,0.87563081048825364,1.8079130742541509,2.78293894226849E-2,0.39898899459985199,8.8849253455281288E-2,0,0.48433236252218181,5.7115729232792676,81.886623656404865,18.235002665028009,0,99.402094872934782]
["Use My Weights:",false,null,null,null,null,null,null,null,null,null,null,null,null,null,null,null,null,null,null,null,null,null,null,null,null,null,null,133,-1.4032608843002614,1.4032608843002614,2.8476974429979523E-2,-2.8476974429979523E-2,-1.4804186264827487E-2,-0.20996019663452031,133,1,0,0,1,0,1,2.5000000000000001E-3,null,1,0.8003836158712081,2.2871884201547182E-4,0.19938766518677645,1,0,0,null,null,null,null,0.36204043874444891,9.0510109686112227E-4,null,null,null,null,null,null,null,null,1,1,1,1,1,1,1,1,null,1,9.0510109686112227E-4,null,null,null,{"$f":"CB$149*(H$16+($BW175*MMULT($AD175:$AH175,CC$3:CC$7)))","v":-2.8973522989481619},-0.41878542437319499,-1.744888566490969,0,-0.20996019663452031,5.5169098129568973E-2,0.65784533770009024,0.17466445135512709,0,0.81061651059329753,1.6982953977780837,3.2484983591045402E-2,0.38735625060325984,0.10284692026113028,0,0.47731184554456457,6.6670651617151373,79.499174020868978,21.107817928887254,0,97.961237006175566]
["Interpolate Prices:",null,null,null,null,null,null,null,null,null,null,null,null,null,null,null,null,null,null,null,null,null,null,null,null,null,null,null,141,-1.4880500246305104,1.4880500246305104,3.2533496360486774E-2,-3.2533496360486774E-2,-1.4804186264827487E-2,-0.13558276354007168,141,1,0,0,1,0,1,2.5000000000000001E-3,null,1,0.98374072727270478,7.6959310264971084E-6,1.6251576696268741E-2,1,0,0,null,null,null,null,0.36204043874444891,9.0510109686112227E-4,null,null,null,null,null,null,null,null,1,1,1,1,1,1,1,1,null,1,9.0510109686112227E-4,null,null,null,{"$f":"CB$149*(H$16+($BW176*MMULT($AD176:$AH176,CC$3:CC$7)))","v":-2.9861979612089184},-0.32993976211243869,-1.8256211848907107,0,-0.13558276354007168,5.0478995434788058E-2,0.71896704118331645,0.16111752926326786,0,0.87320689024429732,1.8037704561256698,2.7985265676882313E-2,0.39859120584976782,8.9322634549261468E-2,0,0.48410089392408834,5.743564232155431,81.804983365284642,18.33215717308077,0,99.354589347126065]
["Ignore Embedded Price Phrases:",false,null,null,null,null,null,null,null,null,null,null,null,null,null,null,null,null,null,null,null,null,null,null,null,null,null,null,146,-1.4167789942853315,1.4167789942853315,3.0292781542977223E-2,-3.0292781542977223E-2,-1.4804186264827487E-2,-0.1984042705116304,146,1,0,0,1,0,1,2.5000000000000001E-3,null,1,0.96487334208864728,1.0089280980453009E-6,3.5125648883254701E-2,1,0,0,null,null,null,null,0.36204043874444891,9.0510109686112227E-4,null,null,null,null,null,null,null,null,1,1,1,1,1,1,1,1,null,1,9.0510109686112227E-4,null,null,null,{"$f":"CB$149*(H$16+($BW177*MMULT($AD177:$AH177,CC$3:CC$7)))","v":-2.9126862160462297},-0.40345150727512724,-1.7565908693630414,0,-0.1984042705116304,5.4329592655423663E-2,0.66801041965906682,0.17263238814379636,0,0.82003826882697239,1.7150106692852591,3.1678865693626178E-2,0.38950802558998898,0.10065965841235375,0,0.47815345030403117,6.5016213179448039,79.940794193145337,20.658914600041296,0,98.133964006515498]
["Vertical Layout:",false,null,null,null,null,null,null,null,null,null,null,null,null,null,null,null,null,null,null,null,null,null,null,null,null,null,null,147,-1.4880500246305104,1.4880500246305104,3.2533496360486774E-2,-3.2533496360486774E-2,-1.4804186264827487E-2,-0.13558276354007168,147,1,0,0,1,0,1,2.5000000000000001E-3,null,1,0.98374072727270478,7.6959310264971033E-6,1.6251576696268727E-2,1,0,0,null,null,null,null,0.36204043874444891,9.0510109686112227E-4,null,null,null,null,null,null,null,null,1,1,1,1,1,1,1,1,null,1,9.0510109686112227E-4,null,null,null,{"$f":"CB$149*(H$16+($BW178*MMULT($AD178:$AH178,CC$3:CC$7)))","v":-2.9861979612089184},-0.32993976211243869,-1.8256211848907107,0,-0.13558276354007168,5.0478995434788058E-2,0.71896704118331645,0.16111752926326786,0,0.87320689024429732,1.8037704561256698,2.7985265676882313E-2,0.39859120584976782,8.9322634549261468E-2,0,0.48410089392408834,5.743564232155431,81.804983365284642,18.33215717308077,0,99.354589347126065]
["Vertical Layout Attribute:","Fashion",null,null,null,null,null,null,null,null,null,null,null,null,null,null,null,null,null,null,null,null,null,null,null,null,null,null,159,-1.4912056541372154,1.4912056541372154,3.2669366451961293E-2,-3.2669366451961293E-2,-1.4804186264827487E-2,-0.13281072609474856,159,1,0,0,1,0,1,2.5000000000000001E-3,null,1,0.99060320138785152,1.0605011965629711E-6,9.3957380109519137E-3,1,0,0,null,null,null,null,0.36204043874444891,9.0510109686112227E-4,null,null,null,null,null,null,null,null,1,1,1,1,1,1,1,1,null,1,9.0510109686112227E-4,null,null,null,{"$f":"CB$149*(H$16+($BW179*MMULT($AD179:$AH179,CC$3:CC$7)))","v":-2.9894894608070981},-0.32664826251425927,-1.8286409443059413,0,-0.13281072609474856,5.0313116985782211E-2,0.72133741982059119,0.16063172695952382,0,0.87563081048825353,1.8079130742541507,2.7829389422684904E-2,0.39898899459985199,8.8849253455281288E-2,0,0.48433236252218181,5.7115729232792685,81.886623656404865,18.235002665028009,0,99.402094872934782]
[null,null,null,null,null,null,null,null,null,null,null,null,null,null,null,null,null,null,null,null,null,null,null,null,null,null,null,null,164,-1.4088214671139885,1.4088214671139885,3.0043685118883834E-2,-3.0043685118883834E-2,-1.4804186264827487E-2,-0.20541867455809726,164,1,0,0,1,0,1,2.5000000000000001E-3,null,1,0.97633418415089135,4.5128465027787173E-7,2.3665364464458358E-2,1,0,0,null,null,null,null,0.36204043874444891,9.0510109686112227E-4,null,null,null,null,null,null,null,null,1,1,1,1,1,1,1,1,null,1,9.0510109686112227E-4,null,null,null,{"$f":"CB$149*(H$16+($BW180*MMULT($AD180:$AH180,CC$3:CC$7)))","v":-2.9044795924507936},-0.41165813087056358,-1.7488824386157917,0,-0.20541867455809726,5.4777289700359125E-2,0.66255074298460159,0.17396825505657701,0,0.81430631569535405,1.7056026034368919,3.2116091749613648E-2,0.38845551809637369,0.10199811767759999,0,0.47743027247641262,6.5913555361412905,79.724782508132165,20.933613681008595,0,97.985542392364863]
[null,null,null,null,null,null,null,null,null,null,null,null,null,null,null,null,null,null,null,null,null,null,null,null,null,null,null,null,165,-0.96581045908081231,0.96581045908081231,1.2659049335853148E-2,-1.2659049335853148E-2,-1.4804186264827485E-2,-0.5950149929358074,165,1,0,0,1,0,1,2.5000000000000001E-3,null,1,0.53836333975246087,6.9307835533160471E-4,0.46094358179220751,1,0,0,null,null,null,null,0.36204043874444891,9.0510109686112227E-4,null,null,null,null,null,null,null,null,1,1,1,1,1,1,1,1,null,1,9.0510109686112227E-4,null,null,null,{"$f":"CB$149*(H$16+($BW181*MMULT($AD181:$AH181,CC$3:CC$7)))","v":-2.4440839486345864},-0.87205377468677026,-1.3232560663656463,0,-0.5950149929358074,8.6805616895261145E-2,0.41809200012305886,0.26626690623832799,0,0.55155429638767794,1.3227188196443258,6.5626658973978194E-2,0.31608531905177117,0.20130272759703091,0,0.41698529437721982,13.468906656482927,64.871863421860525,41.314424505061197,0,85.580099534242294]
[null,null,null,null,null,null,null,null,null,null,null,null,null,null,null,null,null,null,null,null,null,null,null,null,null,null,null,null,167,-1.4938885307423599,1.4938885307423599,3.2761046898824052E-2,-3.2761046898824052E-2,-1.4804186264827487E-2,-0.13044781300074682,167,1,0,0,1,0,1,2.5000000000000001E-3,null,1,0.9945837271607868,1.4570810351619567E-7,5.4161270311097274E-3,1,0,0,null,null,null,null,0.36204043874444891,9.0510109686112227E-4,null,null,null,null,null,null,null,null,1,1,1,1,1,1,1,1,null,1,9.0510109686112227E-4,null,null,null,{"$f":"CB$149*(H$16+($BW182*MMULT($AD182:$AH182,CC$3:CC$7)))","v":-2.9922640178591049},-0.32387370546225203,-1.8312321404642231,0,-0.13044781300074682,5.0173713852642965E-2,0.72334159070315562,0.16021603744485341,0,0.87770229640264263,1.8114336384032945,2.7698344995331466E-2,0.3993199504348125,8.8447091876949671E-2,0,0.48453461269290643,5.6846779816889068,81.95454747453293,18.152464915216306,0,99.443603746208794]
["Census Variable Table",null,"to",null,null,null,null,null,null,null,null,null,null,null,null,null,null,null,null,null,null,null,null,null,null,null,null,null,169,-1.3560819265325976,1.3560819265325976,2.7606331862029165E-2,-2.7606331862029165E-2,-1.4804186264827487E-2,-0.25170423807941694,169,1,0,0,1,0,1,2.5000000000000001E-3,null,1,0.88632384947404019,1.598643919373871E-4,0.11351628603402242,1,0,0,null,null,null,null,0.36204043874444891,9.0510109686112227E-4,null,null,null,null,null,null,null,null,1,1,1,1,1,1,1,1,null,1,9.0510109686112227E-4,null,null,null,{"$f":"CB$149*(H$16+($BW183*MMULT($AD183:$AH183,CC$3:CC$7)))","v":-2.849302698612548},-0.46683502470880911,-1.6985802512912556,0,-0.25170423807941694,5.78846698661096E-2,0.62698351866915336,0.18294307295362841,0,0.77747465146357808,1.6452859129524695,3.5182134248165672E-2,0.3810787618937489,0.11119226847650851,0,0.47254683538157688,7.2206156701088196,78.210811779252296,22.820577924384583,0,96.983288743901213]
["Age","Y",true,null,null,null,null,null,null,null,null,null,null,null,null,null,null,null,null,null,null,null,null,null,null,null,null,null,176,-1.4927860841093585,1.4927860841093585,3.2711235646094093E-2,-3.2711235646094093E-2,-1.4804186264827487E-2,-0.13141564248285845,176,1,0,0,1,0,1,2.5000000000000001E-3,null,1,0.98595245850217972,2.3878401635485884E-6,1.4045153557656771E-2,1,0,0,null,null,null,null,0.36204043874444891,9.0510109686112227E-4,null,null,null,null,null,null,null,null,1,1,1,1,1,1,1,1,null,1,9.0510109686112227E-4,null,null,null,{"$f":"CB$149*(H$16+($BW184*MMULT($AD184:$AH184,CC$3:CC$7)))","v":-2.9911117599733741},-0.32502596334798328,-1.8301795050839516,0,-0.13141564248285845,5.023156023065848E-2,0.7225085946564862,0.16038477530849671,0,0.87685324118028052,1.809978171375922,2.7752577917817153E-2,0.39918083327338943,8.8611441753783299E-2,0,0.48445514705501008,5.6958084914861162,81.925995722991459,18.186195310526454,0,99.42729459264288]
["Income","N",true,null,null,null,null,null,null,null,null,null,null,null,null,null,null,null,null,null,null,null,null,null,null,null,null,null,185,-1.4002585570637802,1.4002585570637802,2.9772653104801067E-2,-2.9772653104801067E-2,-1.4804186264827487E-2,-0.21296594002319746,185,1,0,0,1,0,1,2.5000000000000001E-3,null,1,0.98411717798346376,2.0107636995313111E-7,1.5882620840166308E-2,1,0,0,null,null,null,null,0.36204043874444891,9.0510109686112227E-4,null,null,null,null,null,null,null,null,1,1,1,1,1,1,1,1,null,1,9.0510109686112227E-4,null,null,null,{"$f":"CB$149*(H$16+($BW185*MMULT($AD185:$AH185,CC$3:CC$7)))","v":-2.8956456503865025},-0.42049207293485469,-1.7405905605796663,0,-0.21296594002319746,5.5263332781383637E-2,0.65672358439231726,0.17541677578884621,0,0.80818366346454384,1.6955873564270909,3.2592442124499833E-2,0.38731332945071767,0.10345487368959926,0,0.47663935473518326,6.6891194454341081,79.490365085503115,21.232591429588915,0,97.823218157120778]
["Gender","Y",false,null,null,null,null,null,null,null,null,null,null,null,null,null,null,null,null,null,null,null,null,null,null,null,null,null,188,-1.4912056541372154,1.4912056541372154,3.2669366451961293E-2,-3.2669366451961293E-2,-1.4804186264827487E-2,-0.13281072609474853,188,1,0,0,1,0,1,2.5000000000000001E-3,null,1,0.99060320138785152,1.0605011965629673E-6,9.3957380109519137E-3,1,0,0,null,null,null,null,{"$f":"$BC$154/$BB$154","v":0.36204043874444891},9.0510109686112227E-4,null,null,null,null,null,null,null,null,1,1,1,1,1,1,1,1,null,1,9.0510109686112227E-4,null,null,null,{"$f":"CB$149*(H$16+($BW186*MMULT($AD186:$AH186,CC$3:CC$7)))","v":-2.9894894608070981},-0.32664826251425927,-1.8286409443059413,0,-0.13281072609474853,5.0313116985782211E-2,0.72133741982059119,0.16063172695952382,0,0.87563081048825364,1.8079130742541509,2.78293894226849E-2,0.39898899459985199,8.8849253455281288E-2,0,0.48433236252218181,5.7115729232792676,81.886623656404865,18.235002665028009,0,99.402094872934782]
["Education","N",true,null,null,null,null,null,null,null,null,null,null,null,null,null,null,null,null,null,null,null,null,null,null,null,null,null,189,-1.4938885307423599,1.4938885307423599,3.2761046898824052E-2,-3.2761046898824052E-2,-1.4804186264827487E-2,-0.13044781300074684,189,1,0,0,1,0,1,2.5000000000000001E-3,null,1,0.9945837271607868,1.4570810351619564E-7,5.4161270311097178E-3,1,0,0,null,null,null,null,0.36204043874444891,9.0510109686112227E-4,null,null,null,null,null,null,null,null,1,1,1,1,1,1,1,1,null,1,9.0510109686112227E-4,null,null,null,{"$f":"CB$149*(H$16+($BW187*MMULT($AD187:$AH187,CC$3:CC$7)))","v":-2.9922640178591049},-0.32387370546225203,-1.8312321404642231,0,-0.13044781300074684,5.0173713852642965E-2,0.72334159070315562,0.16021603744485341,0,0.87770229640264263,1.8114336384032945,2.7698344995331466E-2,0.3993199504348125,8.8447091876949671E-2,0,0.48453461269290643,5.6846779816889068,81.95454747453293,18.152464915216306,0,99.443603746208794]
["Children","N",false,null,null,null,null,null,null,null,null,null,null,null,null,null,null,null,null,null,null,null,null,null,null,null,null,null,214,-1.4952532792793085,1.4952532792793085,3.2803120813189181E-2,-3.2803120813189181E-2,-1.4804186264827487E-2,-0.12924464664911348,214,1,0,0,1,0,1,2.5000000000000001E-3,null,1,0.99188727488390782,3.2873240558908849E-7,8.1123962836866046E-3,1,0,0,null,null,null,null,0.36204043874444891,9.0510109686112227E-4,null,null,null,null,null,null,null,null,1,1,1,1,1,1,1,1,null,1,9.0510109686112227E-4,null,null,null,{"$f":"CB$149*(H$16+($BW188*MMULT($AD188:$AH188,CC$3:CC$7)))","v":-2.9936708403104189},-0.32246688301093829,-1.8325548150868065,0,-0.12924464664911348,5.0103177972892314E-2,0.72435992002925309,0.16000426384265318,0,0.87875895381227687,1.8132263156570754,2.7632059793228827E-2,0.39948676774347397,8.8242853338840369E-2,0,0.48463831912445687,5.6710739187397241,81.988784273939984,18.110547958777286,0,99.464887966189934]
["Marital","N",false,null,null,null,null,null,null,null,null,null,null,null,null,null,null,null,null,null,null,null,null,null,null,null,null,null,231,-1.4927860841093583,1.4927860841093583,3.2711235646094093E-2,-3.2711235646094093E-2,-1.4804186264827487E-2,-0.13141564248285847,231,1,0,0,1,0,1,2.5000000000000001E-3,null,1,0.98595245850217961,2.3878401635485944E-6,1.404515355765683E-2,1,0,0,null,null,null,null,0.36204043874444891,9.0510109686112227E-4,null,null,null,null,null,null,null,null,1,1,1,1,1,1,1,1,null,1,9.0510109686112227E-4,null,null,null,{"$f":"CB$149*(H$16+($BW189*MMULT($AD189:$AH189,CC$3:CC$7)))","v":-2.9911117599733736},-0.3250259633479835,-1.8301795050839513,0,-0.13141564248285847,5.0231560230658501E-2,0.72250859465648609,0.16038477530849674,0,0.87685324118028052,1.809978171375922,2.7752577917817163E-2,0.39918083327338938,8.8611441753783313E-2,0,0.48445514705501008,5.6958084914861189,81.925995722991445,18.186195310526454,0,99.42729459264288]
["SEL","N",true,null,null,null,null,null,null,null,null,null,null,null,null,null,null,null,null,null,null,null,null,null,null,null,null,null,233,-1.3761586536534796,1.3761586536534796,2.8872122505838104E-2,-2.8872122505838104E-2,-1.4804186264827487E-2,-0.23417175607223939,233,1,0,0,1,0,1,2.5000000000000001E-3,null,1,0.93148235225987319,2.2991370308330411E-5,6.8494656269818474E-2,1,0,0,null,null,null,null,0.36204043874444891,9.0510109686112227E-4,null,null,null,null,null,null,null,null,1,1,1,1,1,1,1,1,null,1,9.0510109686112227E-4,null,null,null,{"$f":"CB$149*(H$16+($BW190*MMULT($AD190:$AH190,CC$3:CC$7)))","v":-2.8706452163772389},-0.44549250694411824,-1.7173911877683286,0,-0.23417175607223939,5.6662355303307738E-2,0.64050874333381391,0.17953390775194575,0,0.79122590637034262,1.66793091275941,3.3971644071016133E-2,0.38401395311641656,0.10763869557098529,0,0.47437570724158207,6.9721803625750125,78.813216613128034,22.091259343951027,0,97.35863779799287]
["Revenue","N",true,null,null,null,null,null,null,null,null,null,null,null,null,null,null,null,null,null,null,null,null,null,null,null,null,null,237,-1.4927860841093583,1.4927860841093583,3.2711235646094093E-2,-3.2711235646094093E-2,-1.4804186264827487E-2,-0.13141564248285845,237,1,0,0,1,0,1,2.5000000000000001E-3,null,1,0.98595245850217961,2.3878401635485944E-6,1.4045153557656807E-2,1,0,0,null,null,null,null,0.36204043874444891,9.0510109686112227E-4,null,null,null,null,null,null,null,null,1,1,1,1,1,1,1,1,null,1,9.0510109686112227E-4,null,null,null,{"$f":"CB$149*(H$16+($BW191*MMULT($AD191:$AH191,CC$3:CC$7)))","v":-2.9911117599733736},-0.3250259633479835,-1.8301795050839513,0,-0.13141564248285845,5.0231560230658501E-2,0.72250859465648609,0.16038477530849674,0,0.87685324118028052,1.809978171375922,2.7752577917817163E-2,0.39918083327338938,8.8611441753783313E-2,0,0.48445514705501008,5.6958084914861189,81.925995722991445,18.186195310526454,0,99.42729459264288]
["Business Type","N",true,null,null,null,null,null,null,null,null,null,null,null,null,null,null,null,null,null,null,null,null,null,null,null,null,null,239,-1.4898398199552998,1.4898398199552998,3.2540951151560631E-2,-3.2540951151560631E-2,-1.4804186264827487E-2,-0.13399253750380746,239,1,0,0,1,0,1,2.5000000000000001E-3,null,1,0.97577229117977271,1.7268986071482593E-5,2.4210439734155834E-2,1,0,0,null,null,null,null,0.36204043874444891,9.0510109686112227E-4,null,null,null,null,null,null,null,null,1,1,1,1,1,1,1,1,null,1,9.0510109686112227E-4,null,null,null,{"$f":"CB$149*(H$16+($BW192*MMULT($AD192:$AH192,CC$3:CC$7)))","v":-2.9879952113247814},-0.32814251199657551,-1.8274035254244263,0,-0.13399253750380746,5.0388353531878087E-2,0.72026036664792381,0.16083061872226651,0,0.87459659125271372,1.806075930154782,2.7899354999742325E-2,0.39879849712973975,8.9049754795460456E-2,0,0.48425239307505757,5.7259323290647588,81.847526852097715,18.276152616550664,0,99.385682319933807]
["Employees","N",false,null,null,null,null,null,null,null,null,null,null,null,null,null,null,null,null,null,null,null,null,null,null,null,null,null,245,-1.4938885307423599,1.4938885307423599,3.2761046898824052E-2,-3.2761046898824052E-2,-1.4804186264827487E-2,-0.13044781300074682,245,1,0,0,1,0,1,2.5000000000000001E-3,null,1,0.9945837271607868,1.4570810351619588E-7,5.4161270311097178E-3,1,0,0,null,null,null,null,0.36204043874444891,9.0510109686112227E-4,null,null,null,null,null,null,null,null,1,1,1,1,1,1,1,1,null,1,9.0510109686112227E-4,null,null,null,{"$f":"CB$149*(H$16+($BW193*MMULT($AD193:$AH193,CC$3:CC$7)))","v":-2.9922640178591049},-0.32387370546225203,-1.8312321404642231,0,-0.13044781300074682,5.0173713852642965E-2,0.72334159070315562,0.16021603744485341,0,0.87770229640264263,1.8114336384032945,2.7698344995331466E-2,0.3993199504348125,8.8447091876949671E-2,0,0.48453461269290643,5.6846779816889068,81.95454747453293,18.152464915216306,0,99.443603746208794]
[null,null,null,null,null,null,null,null,null,null,null,null,null,null,null,null,null,null,null,null,null,null,null,null,null,null,null,null,255,-1.3749580116879907,1.3749580116879907,2.5333849608828934E-2,-2.5333849608828934E-2,-1.4804186264827487E-2,-0.23432511134873285,255,1,0,0,1,0,1,2.5000000000000001E-3,null,1,0.77530137833674651,7.1565802608015386E-4,0.22398296353717331,1,0,0,null,null,null,null,0.36204043874444891,9.0510109686112227E-4,null,null,null,null,null,null,null,null,1,1,1,1,1,1,1,1,null,1,9.0510109686112227E-4,null,null,null,{"$f":"CB$149*(H$16+($BW194*MMULT($AD194:$AH194,CC$3:CC$7)))","v":-2.865906301514741},-0.45023142180661635,-1.7197288186998489,0,-0.23432511134873285,5.6931510629377617E-2,0.63748060763608194,0.17911471388709149,0,0.7911045770061893,1.6646314091587404,3.4200670680693969E-2,0.38295601304209881,0.10760022483152064,0,0.47524309144568655,7.0191847061730099,78.596089970816578,22.083363790422073,0,97.536655650235247]
[null,null,null,null,null,null,null,null,null,null,null,null,null,null,null,null,null,null,null,null,null,null,null,null,null,null,null,null,268,-1.4860598656642861,1.4860598656642861,3.249289496710165E-2,-3.249289496710165E-2,-1.4804186264827487E-2,-0.13734265866530621,268,1,0,0,1,0,1,2.5000000000000001E-3,null,1,0.98911672584232391,3.4205049085686163E-6,1.0879853552767554E-2,1,0,0,null,null,null,null,0.36204043874444891,9.0510109686112227E-4,null,null,null,null,null,null,null,null,1,1,1,1,1,1,1,1,null,1,9.0510109686112227E-4,null,null,null,{"$f":"CB$149*(H$16+($BW195*MMULT($AD195:$AH195,CC$3:CC$7)))","v":-2.984167200849309},-0.33197052247204817,-1.8236716273178715,0,-0.13734265866530621,5.0581610335581138E-2,0.71750847291878206,0.16143194354734966,0,0.87167148916356474,1.8011935159652777,2.8082274273830008E-2,0.39835168545688554,8.9624985942077781E-2,0,0.48394105432720663,5.7634738200819315,81.755825327004274,18.394210350112306,0,99.321784620448398]
[null,null,null,null,null,null,null,null,null,null,null,null,null,null,null,null,null,null,null,null,null,null,null,null,null,null,null,null,272,-1.3952763391632135,1.3952763391632135,2.8977486019232328E-2,-2.8977486019232328E-2,-1.4804186264827487E-2,-0.21719242142755768,272,1,0,0,1,0,1,2.5000000000000001E-3,null,1,0.85763763368050983,1.0833523774172541E-4,0.14225403098174844,1,0,0,null,null,null,null,0.36204043874444891,9.0510109686112227E-4,null,null,null,null,null,null,null,null,1,1,1,1,1,1,1,1,null,1,9.0510109686112227E-4,null,null,null,{"$f":"CB$149*(H$16+($BW196*MMULT($AD196:$AH196,CC$3:CC$7)))","v":-2.8898682654003669},-0.42626945792099025,-1.7364035097646684,0,-0.21719242142755768,5.5583534403856674E-2,0.65294037845742914,0.17615279454155044,0,0.80477509843193895,1.6894518058347752,3.2900337382747828E-2,0.38648061827061397,0.10426624419422936,0,0.47635280015240888,6.7523104193180643,79.319463361539476,21.39911329374506,0,97.764407043044315]
[null,null,null,null,null,null,null,null,null,null,null,null,null,null,null,null,null,null,null,null,null,null,null,null,null,null,null,null,279,-1.3761586536534798,1.3761586536534798,2.8872122505838108E-2,-2.8872122505838108E-2,-1.4804186264827487E-2,-0.23417175607223936,279,1,0,0,1,0,1,2.5000000000000001E-3,null,1,0.9314823522598733,2.2991370308330373E-5,6.8494656269818363E-2,1,0,0,null,null,null,null,0.36204043874444891,9.0510109686112227E-4,null,null,null,null,null,null,null,null,1,1,1,1,1,1,1,1,null,1,9.0510109686112227E-4,null,null,null,{"$f":"CB$149*(H$16+($BW197*MMULT($AD197:$AH197,CC$3:CC$7)))","v":-2.8706452163772394},-0.44549250694411802,-1.7173911877683288,0,-0.23417175607223936,5.6662355303307717E-2,0.64050874333381402,0.17953390775194569,0,0.79122590637034262,1.66793091275941,3.3971644071016119E-2,0.38401395311641662,0.10763869557098525,0,0.47437570724158207,6.9721803625750089,78.813216613128034,22.091259343951016,0,97.35863779799287]
[null,null,null,null,null,null,null,null,null,null,null,null,null,null,null,null,null,null,null,null,null,null,null,null,null,null,null,null,282,-1.402527369750342,1.402527369750342,2.979584069310056E-2,-2.979584069310056E-2,-1.4804186264827487E-2,-0.21095366036781277,282,1,0,0,1,0,1,2.5000000000000001E-3,null,1,0.94036689890958491,7.1854888887815823E-6,5.9625915501526301E-2,1,0,0,null,null,null,null,0.36204043874444891,9.0510109686112227E-4,null,null,null,null,null,null,null,null,1,1,1,1,1,1,1,1,null,1,9.0510109686112227E-4,null,null,null,{"$f":"CB$149*(H$16+($BW198*MMULT($AD198:$AH198,CC$3:CC$7)))","v":-2.8979376506613637},-0.41820007265999348,-1.7428361856779286,0,-0.21095366036781277,5.5136814253096036E-2,0.65823052131848181,0.17502329744225764,0,0.8098115923831426,1.6982022253969782,3.246775526996324E-2,0.38760432148451068,0.10306387238501205,0,0.47686405086051398,6.6635293021706863,79.550086921144512,21.15234416184158,0,97.869333732490119]
[null,null,null,null,null,null,null,null,null,null,null,null,null,null,null,null,null,null,null,null,null,null,null,null,null,null,null,null,289,-1.4898398199552998,1.4898398199552998,3.2540951151560631E-2,-3.2540951151560631E-2,-1.4804186264827487E-2,-0.13399253750380746,289,1,0,0,1,0,1,2.5000000000000001E-3,null,1,0.97577229117977271,1.7268986071482593E-5,2.4210439734155792E-2,1,0,0,null,null,null,null,0.36204043874444891,9.0510109686112227E-4,null,null,null,null,null,null,null,null,1,1,1,1,1,1,1,1,null,1,9.0510109686112227E-4,null,null,null,{"$f":"CB$149*(H$16+($BW199*MMULT($AD199:$AH199,CC$3:CC$7)))","v":-2.9879952113247814},-0.32814251199657551,-1.8274035254244263,0,-0.13399253750380746,5.0388353531878087E-2,0.72026036664792381,0.16083061872226651,0,0.87459659125271372,1.806075930154782,2.7899354999742325E-2,0.39879849712973975,8.9049754795460456E-2,0,0.48425239307505757,5.7259323290647588,81.847526852097715,18.276152616550664,0,99.385682319933807]
[null,null,null,null,null,null,null,null,null,null,null,null,null,null,null,null,null,null,null,null,null,null,null,null,null,null,null,null,298,-1.4898398199552998,1.4898398199552998,3.2540951151560631E-2,-3.2540951151560631E-2,-1.4804186264827487E-2,-0.13399253750380744,298,1,0,0,1,0,1,2.5000000000000001E-3,null,1,0.97577229117977271,1.7268986071482559E-5,2.4210439734155834E-2,1,0,0,null,null,null,null,0.36204043874444891,9.0510109686112227E-4,null,null,null,null,null,null,null,null,1,1,1,1,1,1,1,1,null,1,9.0510109686112227E-4,null,null,null,{"$f":"CB$149*(H$16+($BW200*MMULT($AD200:$AH200,CC$3:CC$7)))","v":-2.9879952113247814},-0.32814251199657551,-1.8274035254244263,0,-0.13399253750380744,5.0388353531878087E-2,0.72026036664792381,0.16083061872226651,0,0.87459659125271372,1.806075930154782,2.7899354999742325E-2,0.39879849712973975,8.9049754795460456E-2,0,0.48425239307505757,5.7259323290647588,81.847526852097715,18.276152616550664,0,99.385682319933807]
[null,null,null,null,null,null,null,null,null,null,null,null,null,null,null,null,null,null,null,null,null,null,null,null,null,null,null,null,300,-1.4841839195483804,1.4841839195483804,3.2206406230210871E-2,-3.2206406230210871E-2,-1.4804186264827487E-2,-0.13893738712580556,300,1,0,0,1,0,1,2.5000000000000001E-3,null,1,0.97197688171982055,5.5565538786142424E-5,2.796755264139333E-2,1,0,0,null,null,null,null,0.36204043874444891,9.0510109686112227E-4,null,null,null,null,null,null,null,null,1,1,1,1,1,1,1,1,null,1,9.0510109686112227E-4,null,null,null,{"$f":"CB$149*(H$16+($BW201*MMULT($AD201:$AH201,CC$3:CC$7)))","v":-2.9820047659965123},-0.33413295732484483,-1.8220821699388567,0,-0.13893738712580556,5.0691108120926275E-2,0.71595858396067225,0.16168873676810649,0,0.87028251764216236,1.7986209464918672,2.8183319125576235E-2,0.39805973868875411,8.9895948939921672E-2,0,0.48386099324574805,5.7842117899491425,81.695907546180123,18.449821520669794,0,99.305353260847866]
[null,null,null,null,null,null,null,null,null,null,null,null,null,null,null,null,null,null,null,null,null,null,null,null,null,null,null,null,306,-1.4898398199552998,1.4898398199552998,3.2540951151560631E-2,-3.2540951151560631E-2,-1.4804186264827487E-2,-0.13399253750380744,306,1,0,0,1,0,1,2.5000000000000001E-3,null,1,0.97577229117977271,1.7268986071482576E-5,2.4210439734155858E-2,1,0,0,null,null,null,null,0.36204043874444891,9.0510109686112227E-4,null,null,null,null,null,null,null,null,1,1,1,1,1,1,1,1,null,1,9.0510109686112227E-4,null,null,null,{"$f":"CB$149*(H$16+($BW202*MMULT($AD202:$AH202,CC$3:CC$7)))","v":-2.9879952113247814},-0.32814251199657551,-1.8274035254244263,0,-0.13399253750380744,5.0388353531878087E-2,0.72026036664792381,0.16083061872226651,0,0.87459659125271372,1.806075930154782,2.7899354999742325E-2,0.39879849712973975,8.9049754795460456E-2,0,0.48425239307505757,5.7259323290647588,81.847526852097715,18.276152616550664,0,99.385682319933807]
[null,null,null,null,null,null,null,null,null,null,null,null,null,null,null,null,null,null,null,null,null,null,null,null,null,null,null,null,308,-0.34647482080698216,0.34647482080698216,-0.34443900143910794,0.34443900143910794,-1.4804186264827485E-2,-1.0536432644525888,308,1,0,0,1,0,1,2.5000000000000001E-3,null,3,6.8060101720374541E-3,7.6995253385799253E-2,0.91619873634216331,0,0,1,null,null,null,null,0.36204043874444891,9.0510109686112227E-4,null,null,null,null,null,null,null,null,1,1,1,1,1,1,1,1,null,1,9.0510109686112227E-4,null,null,null,{"$f":"CB$149*(H$16+($BW203*MMULT($AD203:$AH203,CC$3:CC$7)))","v":-1.4676502595857952},-1.8484874637355615,-1.0610184788667771,0,-1.0536432644525888,0.2304663856304672,0.15747517318142856,0.34610313203714427,0,0.34866515295899853,1.0827098438080385,0.21286070958760792,0.14544540634041606,0.31966378990316763,0,0.32203009416880846,43.686530338303733,29.850530748335959,65.606291939538309,0,66.091941091468939]
[null,null,null,null,null,null,null,null,null,null,null,null,null,null,null,null,null,null,null,null,null,null,null,null,null,null,null,null,311,-1.4927860841093585,1.4927860841093585,3.2711235646094093E-2,-3.2711235646094093E-2,-1.4804186264827487E-2,-0.13141564248285845,311,1,0,0,1,0,1,2.5000000000000001E-3,null,1,0.98595245850217961,2.3878401635485923E-6,1.4045153557656795E-2,1,0,0,null,null,null,null,0.36204043874444891,9.0510109686112227E-4,null,null,null,null,null,null,null,null,1,1,1,1,1,1,1,1,null,1,9.0510109686112227E-4,null,null,null,{"$f":"CB$149*(H$16+($BW204*MMULT($AD204:$AH204,CC$3:CC$7)))","v":-2.9911117599733741},-0.32502596334798328,-1.8301795050839516,0,-0.13141564248285845,5.023156023065848E-2,0.7225085946564862,0.16038477530849671,0,0.87685324118028052,1.809978171375922,2.7752577917817153E-2,0.39918083327338943,8.8611441753783299E-2,0,0.48445514705501008,5.6958084914861162,81.925995722991459,18.186195310526454,0,99.42729459264288]
[null,null,null,null,null,null,null,null,null,null,null,null,null,null,null,null,null,null,null,null,null,null,null,null,null,null,null,null,315,-4.0698660326030076E-2,4.0698660326030076E-2,-1.1286851163278024,1.1286851163278024,-1.4804186264827488E-2,-1.1229125853270048,315,1,0,0,1,0,1,2.5000000000000001E-3,null,3,1.0493657099689311E-3,0.44395913073495452,0.55499150345507653,0,0,1,null,null,null,null,0.36204043874444891,9.0510109686112227E-4,null,null,null,null,null,null,null,null,1,1,1,1,1,1,1,1,null,1,9.0510109686112227E-4,null,null,null,{"$f":"CB$149*(H$16+($BW205*MMULT($AD205:$AH205,CC$3:CC$7)))","v":-0.37762798421614896},-2.9385097391052089,-1.5394884332745196,0,-1.1229125853270048,0.68548546465006688,5.2944571199890787E-2,0.2144907997216462,0,0.32533085947884099,1.2782516950504448,0.5362679879904364,4.1419519649298325E-2,0.16780012931113816,0,0.25451236304912717,110.06111824109595,8.5007472974353959,34.438508892150629,0,52.234919686964943]
[null,null,null,null,null,null,null,null,null,null,null,null,null,null,null,null,null,null,null,null,null,null,null,null,null,null,null,null,318,-1.4898398199552998,1.4898398199552998,3.2540951151560631E-2,-3.2540951151560631E-2,-1.4804186264827487E-2,-0.13399253750380744,318,1,0,0,1,0,1,2.5000000000000001E-3,null,1,0.97577229117977271,1.7268986071482623E-5,2.4210439734155834E-2,1,0,0,null,null,null,null,0.36204043874444891,9.0510109686112227E-4,null,null,null,null,null,null,null,null,1,1,1,1,1,1,1,1,null,1,9.0510109686112227E-4,null,null,null,{"$f":"CB$149*(H$16+($BW206*MMULT($AD206:$AH206,CC$3:CC$7)))","v":-2.9879952113247814},-0.32814251199657551,-1.8274035254244263,0,-0.13399253750380744,5.0388353531878087E-2,0.72026036664792381,0.16083061872226651,0,0.87459659125271372,1.806075930154782,2.7899354999742325E-2,0.39879849712973975,8.9049754795460456E-2,0,0.48425239307505757,5.7259323290647588,81.847526852097715,18.276152616550664,0,99.385682319933807]
[null,null,null,null,null,null,null,null,null,null,null,null,null,null,null,null,null,null,null,null,null,null,null,null,null,null,null,null,323,-1.4938885307423599,1.4938885307423599,3.2761046898824052E-2,-3.2761046898824052E-2,-1.4804186264827487E-2,-0.13044781300074682,323,1,0,0,1,0,1,2.5000000000000001E-3,null,1,0.9945837271607868,1.4570810351619588E-7,5.4161270311097178E-3,1,0,0,null,null,null,null,0.36204043874444891,9.0510109686112227E-4,null,null,null,null,null,null,null,null,1,1,1,1,1,1,1,1,null,1,9.0510109686112227E-4,null,null,null,{"$f":"CB$149*(H$16+($BW207*MMULT($AD207:$AH207,CC$3:CC$7)))","v":-2.9922640178591049},-0.32387370546225203,-1.8312321404642231,0,-0.13044781300074682,5.0173713852642965E-2,0.72334159070315562,0.16021603744485341,0,0.87770229640264263,1.8114336384032945,2.7698344995331466E-2,0.3993199504348125,8.8447091876949671E-2,0,0.48453461269290643,5.6846779816889068,81.95454747453293,18.152464915216306,0,99.443603746208794]
[null,null,null,null,null,null,null,null,null,null,null,null,null,null,null,null,null,null,null,null,null,null,null,null,null,null,null,null,327,-0.25136030948163252,0.25136030948163252,-0.59005893679067889,0.59005893679067889,-1.4804186264827487E-2,-1.0747576549052322,327,1,0,0,1,0,1,2.5000000000000001E-3,null,3,4.3711742807685033E-3,0.11186837353806831,0.88376045208116316,0,0,1,null,null,null,null,0.36204043874444891,9.0510109686112227E-4,null,null,null,null,null,null,null,null,1,1,1,1,1,1,1,1,null,1,9.0510109686112227E-4,null,null,null,{"$f":"CB$149*(H$16+($BW208*MMULT($AD208:$AH208,CC$3:CC$7)))","v":-1.1269158129088748},-2.1892219104124822,-1.2115239028929985,0,-1.0747576549052322,0.3240310893825159,0.112003863761395,0.29774320180605679,0,0.34138047716105979,1.0751586321110276,0.30137979615742361,0.10417426825795952,0.27692955524288621,0,0.31751638034173058,61.853771105485308,21.38023658541297,56.8357187201429,0,65.165567706605714]
[null,null,null,null,null,null,null,null,null,null,null,null,null,null,null,null,null,null,null,null,null,null,null,null,null,null,null,null,328,-0.50453387797579985,0.50453387797579985,-0.57492182188889118,0.57492182188889118,-1.4804186264827488E-2,-0.85345453575769292,328,1,0,0,1,0,1,2.5000000000000001E-3,null,3,9.4380634815510012E-2,7.5117554162727335E-2,0.83050181092176267,0,0,1,null,null,null,null,0.36204043874444891,9.0510109686112227E-4,null,null,null,null,null,null,null,null,1,1,1,1,1,1,1,1,null,1,9.0510109686112227E-4,null,null,null,{"$f":"CB$149*(H$16+($BW209*MMULT($AD209:$AH209,CC$3:CC$7)))","v":-1.3952264963048302},-1.9209112270165276,-1.4495603564853781,0,-0.85345453575769292,0.24777690945678557,0.1464734307535846,0.23467343807262925,0,0.42594095919457364,1.054864737477573,0.23488974524760189,0.13885517787222335,0.22246780059573137,0,0.40378727628444339,48.207665951110734,28.497983270363935,45.658244486970958,0,82.8714004092013]
[null,null,null,null,null,null,null,null,null,null,null,null,null,null,null,null,null,null,null,null,null,null,null,null,null,null,null,null,338,-0.21205604250730314,0.21205604250730314,-0.76707443785899165,0.76707443785899165,-1.4804186264827485E-2,-1.0639601724065468,338,1,0,0,1,0,1,2.5000000000000001E-3,null,3,1.8337258075635389E-2,0.14874209309600059,0.83292064872836402,0,0,1,null,null,null,null,0.36204043874444891,9.0510109686112227E-4,null,null,null,null,null,null,null,null,1,1,1,1,1,1,1,1,null,1,9.0510109686112227E-4,null,null,null,{"$f":"CB$149*(H$16+($BW210*MMULT($AD210:$AH210,CC$3:CC$7)))","v":-0.91059604486623247},-2.4055416784551245,-1.3492351369869819,0,-1.0639601724065468,0.40228437302444886,9.0216613975830529E-2,0.25943861978185767,0,0.34508649873447067,1.0970261055166077,0.36670446674102297,8.2237435847842502E-2,0.23649265817579038,0,0.31456543923534414,75.260699085848714,16.878024333713078,48.536640257372476,0,64.559930440712648]
[null,null,null,null,null,null,null,null,null,null,null,null,null,null,null,null,null,null,null,null,null,null,null,null,null,null,null,null,343,-0.346474820806982,0.346474820806982,-0.34443900143910844,0.34443900143910844,-1.4804186264827488E-2,-1.0536432644525888,343,1,0,0,1,0,1,2.5000000000000001E-3,null,3,6.8060101720374645E-3,7.6995253385799378E-2,0.9161987363421632,0,0,1,null,null,null,null,0.36204043874444891,9.0510109686112227E-4,null,null,null,null,null,null,null,null,1,1,1,1,1,1,1,1,null,1,9.0510109686112227E-4,null,null,null,{"$f":"CB$149*(H$16+($BW211*MMULT($AD211:$AH211,CC$3:CC$7)))","v":-1.467650259585795},-1.8484874637355626,-1.0610184788667776,0,-1.0536432644525888,0.23046638563046726,0.1574751731814284,0.3461031320371441,0,0.34866515295899853,1.0827098438080383,0.212860709587608,0.14544540634041594,0.31966378990316757,0,0.32203009416880851,43.686530338303754,29.850530748335935,65.606291939538295,0,66.091941091468954]
[null,null,null,null,null,null,null,null,null,null,null,null,null,null,null,null,null,null,null,null,null,null,null,null,null,null,null,null,349,-0.49889754241467565,0.49889754241467565,-0.14810613670713477,0.14810613670713477,-1.4804186264827487E-2,-0.96880751129098019,349,1,0,0,1,0,1,2.5000000000000001E-3,null,3,5.3037649980979443E-2,2.6024167292549066E-2,0.92093818262647154,0,0,1,null,null,null,null,0.36204043874444891,9.0510109686112227E-4,null,null,null,null,null,null,null,null,1,1,1,1,1,1,1,1,null,1,9.0510109686112227E-4,null,null,null,{"$f":"CB$149*(H$16+($BW212*MMULT($AD212:$AH212,CC$3:CC$7)))","v":-1.8164058459254622},-1.4997318773958952,-1.0171083357424977,0,-0.96880751129098019,0.1626091442214406,0.2231899944091236,0.36163916872457347,0,0.37953535998688626,1.1269736673420239,0.14428832627913615,0.19804366408624163,0.32089407162236738,0,0.33677393801225486,29.613057081641507,40.645549646876269,65.85878917002583,0,69.11789821910331]
[null,null,null,null,null,null,null,null,null,null,null,null,null,null,null,null,null,null,null,null,null,null,null,null,null,null,null,null,350,-1.5898551835429467E-3,1.5898551835429467E-3,-1.2289164662525125,1.2289164662525125,-1.4804186264827488E-2,-1.1317912218791875,350,1,0,0,1,0,1,2.5000000000000001E-3,null,2,5.5863210801952835E-5,0.88386672100960395,0.11607741567959413,0,1,0,null,null,null,null,0.36204043874444891,9.0510109686112227E-4,null,null,null,null,null,null,null,null,1,1,1,1,1,1,1,1,null,1,9.0510109686112227E-4,null,null,null,{"$f":"CB$149*(H$16+($BW213*MMULT($AD213:$AH213,CC$3:CC$7)))","v":-0.23828782914895186},-3.077849894172406,-1.6006109780567426,0,-1.1317912218791875,0.78797585603042897,4.6058180224565384E-2,0.20177320132815268,0,0.32245515009856196,1.358262387681709,0.58013522510577009,3.3909633839730911E-2,0.14855244697789247,0,0.23740269407660658,119.06422355259004,6.959453674518886,30.48820514740391,0,48.723411743134108]
[null,null,null,null,null,null,null,null,null,null,null,null,null,null,null,null,null,null,null,null,null,null,null,null,null,null,null,null,357,-1.4898398199552998,1.4898398199552998,3.2540951151560631E-2,-3.2540951151560631E-2,-1.4804186264827487E-2,-0.13399253750380741,357,1,0,0,1,0,1,2.5000000000000001E-3,null,1,0.97577229117977271,1.7268986071482623E-5,2.4210439734155834E-2,1,0,0,null,null,null,null,0.36204043874444891,9.0510109686112227E-4,null,null,null,null,null,null,null,null,1,1,1,1,1,1,1,1,null,1,9.0510109686112227E-4,null,null,null,{"$f":"CB$149*(H$16+($BW214*MMULT($AD214:$AH214,CC$3:CC$7)))","v":-2.9879952113247814},-0.32814251199657551,-1.8274035254244263,0,-0.13399253750380741,5.0388353531878087E-2,0.72026036664792381,0.16083061872226651,0,0.87459659125271372,1.806075930154782,2.7899354999742325E-2,0.39879849712973975,8.9049754795460456E-2,0,0.48425239307505757,5.7259323290647588,81.847526852097715,18.276152616550664,0,99.385682319933807]
[null,null,null,null,null,null,null,null,null,null,null,null,null,null,null,null,null,null,null,null,null,null,null,null,null,null,null,null,358,-1.3861661008924828,1.3861661008924828,2.9032975971393472E-2,-2.9032975971393472E-2,-1.4804186264827487E-2,-0.22531098661515456,358,1,0,0,1,0,1,2.5000000000000001E-3,null,1,0.90049967691889143,5.0281894137622878E-5,9.9450041086970989E-2,1,0,0,null,null,null,null,0.36204043874444891,9.0510109686112227E-4,null,null,null,null,null,null,null,null,1,1,1,1,1,1,1,1,null,1,9.0510109686112227E-4,null,null,null,{"$f":"CB$149*(H$16+($BW215*MMULT($AD215:$AH215,CC$3:CC$7)))","v":-2.8808135170817977},-0.4353242062395597,-1.7272377815417765,0,-0.22531098661515456,5.6089114815924303E-2,0.64705485384753836,0.17777478518940248,0,0.79826792951267633,1.6791866833655416,3.3402548609727321E-2,0.38533824753223178,0.10586957778458202,0,0.47538962607345886,6.8553818881963853,79.085008567056221,21.728173934729789,0,97.566729727664509]
[null,null,null,null,null,null,null,null,null,null,null,null,null,null,null,null,null,null,null,null,null,null,null,null,null,null,null,null,363,-0.39066143853336432,0.39066143853336432,-0.20637846866034118,0.20637846866034118,-1.4804186264827488E-2,-1.0500270250188048,363,1,0,0,1,0,1,2.5000000000000001E-3,null,3,1.5726176116208587E-3,5.6131184101398598E-2,0.94229619818698052,0,0,1,null,null,null,null,0.36204043874444891,9.0510109686112227E-4,null,null,null,null,null,null,null,null,1,1,1,1,1,1,1,1,null,1,9.0510109686112227E-4,null,null,null,{"$f":"CB$149*(H$16+($BW216*MMULT($AD216:$AH216,CC$3:CC$7)))","v":-1.6498974100909445},-1.6662403132304131,-0.96714456381439273,0,-1.0500270250188048,0.19206961201408101,0.18895614776894012,0.38016703242953082,0,0.34992829216469273,1.1111210843772446,0.17286109922190093,0.17005900655268844,0.34214725809348212,0,0.31493263613192862,35.477198540306588,34.902110227195855,70.220693146362251,0,64.635292203782242]
[null,null,null,null,null,null,null,null,null,null,null,null,null,null,null,null,null,null,null,null,null,null,null,null,null,null,null,null,366,-1.4232821285491441E-3,1.4232821285491441E-3,-1.2292450685995029,1.2292450685995029,-1.4804186264827487E-2,-1.131854451494557,366,1,0,0,1,0,1,2.5000000000000001E-3,null,2,5.8147082106271088E-6,0.93762625880124273,6.2367926390546655E-2,0,1,0,null,null,null,null,0.36204043874444891,9.0510109686112227E-4,null,null,null,null,null,null,null,null,1,1,1,1,1,1,1,1,null,1,9.0510109686112227E-4,null,null,null,{"$f":"CB$149*(H$16+($BW217*MMULT($AD217:$AH217,CC$3:CC$7)))","v":-0.23779265374696745},-3.0783450695743895,-1.6007730073487392,0,-1.131854451494557,0.7883661389129597,4.6035378992428599E-2,0.20174051080768007,0,0.32243476202801902,1.3585767907410873,0.58028824302446347,3.3885003266776591E-2,0.14849400650929201,0,0.23733274719946801,119.09562823013833,6.9543986116343195,30.47621110064232,0,48.709056175231957]
[null,null,null,null,null,null,null,null,null,null,null,null,null,null,null,null,null,null,null,null,null,null,null,null,null,null,null,null,378,-1.0867328931384566E-3,1.0867328931384566E-3,-1.2301203261544442,1.2301203261544442,-1.4804186264827488E-2,-1.1319275677152005,378,1,0,0,1,0,1,2.5000000000000001E-3,null,2,8.2645165943684859E-8,0.9694106599872987,3.0589257267535384E-2,{"$f":"IF($AS218= 1,1,0)","v":0},{"$f":"IF($AS218= 2,1,0)","v":1},{"$f":"IF($AS218= 3,1,0)","v":0},null,null,null,null,0.36204043874444891,{"$f":"AQ218*BD218","v":9.0510109686112227E-4},null,null,null,null,null,null,null,null,{"$f":"INDEX(AK$148:AK$149,2-AK218)","v":1},{"$f":"INDEX(AL$148:AL$149,2-AL218)","v":1},{"$f":"INDEX(AM$148:AM$149,2-AM218)","v":1},{"$f":"INDEX(AN$148:AN$149,2-AN218)","v":1},{"$f":"INDEX(AO$148:AO$149,2-AO218)","v":1},{"$f":"INDEX(AW$148:AW$149,2-AW218)","v":1},{"$f":"INDEX(AX$148:AX$149,2-AX218)","v":1},{"$f":"INDEX(AY$148:AY$149,2-AY218)","v":1},null,1,9.0510109686112227E-4,null,null,null,{"$f":"CB$149*(H$16+($BW218*MMULT($AD218:$AH218,CC$3:CC$7)))","v":-0.23658084695661574},-3.0795568763647418,-1.6013117156682699,0,-1.1319275677152005,{"$f":"$BW218*IF(CB$149=0,0,IF(ABS(CB218)>OverflowTrigger,OverflowTrigger,EXP(CB218)))","v":0.78932206543552386},{"$f":"$BW218*IF(CC$149=0,0,IF(ABS(CC218)>OverflowTrigger,OverflowTrigger,EXP(CC218)))","v":4.5979626794837504E-2},{"$f":"$BW218*IF(CD$149=0,0,IF(ABS(CD218)>OverflowTrigger,OverflowTrigger,EXP(CD218)))","v":0.20163186078408499},{"$f":"$BW218*IF(CE$149=0,0,IF(ABS(CE218)>OverflowTrigger,OverflowTrigger,EXP(CE218)))","v":0},{"$f":"IF(L$12=\"\",0,$BW218*IF($CG$149=0,0,IF(ABS(CF218)>OverflowTrigger,OverflowTrigger,EXP(CF218))))","v":0.32241118767865962},1.3593447406931061,0.58066364021319739,{"$f":"IF($CL218=0,0,CH218/$CL218)","v":3.3824846205969282E-2},{"$f":"IF($CL218=0,0,CI218/$CL218)","v":0.14833018788249142},{"$f":"IF($CL218=0,0,CJ218/$CL218)","v":0},{"$f":"IF($CL218=0,0,CK218/$CL218)","v":0.23718132569834183},{"$f":"CM218*$BX218*TargetMarketSize","v":119.17267298257909},{"$f":"CN218*$BX218*TargetMarketSize","v":6.942052259566279},{"$f":"CO218*$BX218*TargetMarketSize","v":30.442589736588953},{"$f":"CP218*$BX218*TargetMarketSize","v":0},{"$f":"CQ218*$BX218*TargetMarketSize","v":48.67797913891259}]
[null,null,null,null,null,null,null,null,null,null,null,null,null,null,null,null,null,null,null,null,null,null,null,null,null,null,null,null,385,-0.44832026569311934,0.44832026569311934,-8.8662740755081668E-2,8.8662740755081668E-2,-1.4804186264827487E-2,-1.0291667998273175,385,1,0,0,1,0,1,{"$f":"AP219/$AP$554","v":2.5000000000000001E-3},null,3,1.2525622517533469E-2,1.9391062166235758E-2,0.96808331521623081,0,0,1,null,null,null,null,0.36204043874444891,9.0510109686112227E-4,null,null,null,null,null,null,null,null,1,1,1,1,1,1,1,1,null,{"$f":"IF(AND(BN219:BU219),1,0)","v":1},{"$f":"BE219*BW219","v":9.0510109686112227E-4},null,null,null,{"$f":"CB$149*(H$16+($BW219*MMULT($AD219:$AH219,CC$3:CC$7)))","v":-1.8252719651559588},-1.4908657581653983,-0.90708766306888811,0,{"$f":"IF($CG$149=0,0,$L$16+$AI219)","v":-1.0291667998273175},0.16117380450974247,0.22517762176087319,0.40369821890147167,0,0.35730454278590396,{"$f":"IF($CG$149=0,0,SUM(CG219:CK219))","v":1.1473541879579914},{"$f":"IF($CL219=0,0,CG219/$CL219)","v":0.14047432449485564},0.19625815996857435,0.35185143623344012,0,0.31141607930312981,28.830289303679468,40.279101184138554,72.212333001086563,0,63.913570628742306]
[null,null,null,null,null,null,null,null,null,null,null,null,null,null,null,null,null,null,null,null,null,null,null,null,null,null,null,null,398,-1.4088214671139885,1.4088214671139885,3.0043685118883837E-2,-3.0043685118883837E-2,-1.4804186264827487E-2,-0.20541867455809712,398,1,0,0,1,0,1,2.5000000000000001E-3,null,1,0.97633418415089135,4.5128465027787332E-7,2.3665364464458404E-2,1,0,0,null,null,null,null,0.36204043874444891,9.0510109686112227E-4,null,null,null,null,null,null,null,null,1,1,1,1,1,1,1,1,null,1,9.0510109686112227E-4,null,null,null,{"$f":"CB$149*(H$16+($BW220*MMULT($AD220:$AH220,CC$3:CC$7)))","v":-2.9044795924507936},-0.41165813087056358,-1.7488824386157917,0,-0.20541867455809712,5.4777289700359125E-2,0.66255074298460159,0.17396825505657701,0,0.81430631569535417,1.7056026034368919,3.2116091749613648E-2,0.38845551809637369,0.10199811767759999,0,0.47743027247641273,6.5913555361412905,79.724782508132165,20.933613681008595,0,97.985542392364877]
[null,null,null,null,null,null,null,null,null,null,null,null,null,null,null,null,null,null,null,null,null,null,null,null,null,null,null,null,399,-1.1146842513086317,1.1146842513086317,-0.19261105445306367,0.19261105445306367,-1.4804186264827487E-2,-0.40951513801661277,399,1,0,0,1,0,1,2.5000000000000001E-3,null,3,0.41189589653741782,4.593021274594182E-2,0.54217389061664034,0,0,1,null,null,null,null,0.36204043874444891,9.0510109686112227E-4,null,null,null,null,null,null,null,null,1,1,1,1,1,1,1,1,null,1,9.0510109686112227E-4,null,null,null,{"$f":"CB$149*(H$16+($BW221*MMULT($AD221:$AH221,CC$3:CC$7)))","v":-2.3876876370734892},-0.92845008624786796,-1.6773999623823825,0,-0.40951513801661277,9.1841810123384146E-2,0.39516570874309337,0.18685918589665523,0,0.66397210693463327,1.337838811697766,6.8649383857262714E-2,0.2953761733385607,0.13967242111889708,0,0.49630202168527954,14.089276486940555,60.62161581048457,28.665710428460685,0,101.85869139176113]
[null,null,null,null,null,null,null,null,null,null,null,null,null,null,null,null,null,null,null,null,null,null,null,null,null,null,null,null,2,-3.6495529778804236E-4,3.6495529778804236E-4,-1.232103255435397,1.232103255435397,-1.4804186264827487E-2,-1.1320570208027607,2,1,0,0,0,1,1,2.5000000000000001E-3,null,2,2.8585816112522351E-5,0.99380976848216196,6.1616456017255516E-3,0,1,0,null,null,{"$f":"SUM($AQ$222:$AQ$338)","v":0.2925000000000002},{"$f":"Assumptions!S57","v":5.9253640509097968E-2},{"$f":"$BC$222/$BB$222","v":0.20257654874905273},5.0644137187263181E-4,null,null,null,null,null,null,null,null,1,1,1,1,1,1,1,1,null,1,5.0644137187263181E-4,null,null,null,{"$f":"CB$149*(H$16+($BW222*MMULT($AD222:$AH222,CC$3:CC$7)))","v":-0.23387614008031221},-3.0822615832410447,-1.6025728673538722,0,-1.1320570208027607,0.79145983997704683,4.5855433411135862E-2,0.2013777327036971,0,0.32236945325633387,1.3610624593482137,0.58150148403627377,3.3690910432644758E-2,0.14795627586417523,0,0.2368513296669062,66.778238799242459,3.8689835262650822,16.990944636846642,0,27.199439875252558]
[null,null,null,null,null,null,null,null,null,null,null,null,null,null,null,null,null,null,null,null,null,null,null,null,null,null,null,null,16,-2.099920103325636E-5,2.099920103325636E-5,-1.2329328241348225,1.2329328241348225,-1.4804186264827487E-2,-1.1321485373045614,16,1,0,0,0,1,1,2.5000000000000001E-3,null,2,2.3908361978970052E-8,0.9995347788210075,4.6519717063049989E-4,0,1,0,null,null,null,null,0.20257654874905273,5.0644137187263181E-4,null,null,null,null,null,null,null,null,1,1,1,1,1,1,1,1,null,1,5.0644137187263181E-4,null,null,null,{"$f":"CB$149*(H$16+($BW223*MMULT($AD223:$AH223,CC$3:CC$7)))","v":-0.23270261528413183},-3.0834351080372251,-1.6030584799565428,0,-1.1321485373045614,0.79238918292128091,4.5801652485785112E-2,0.20127996487936406,0,0.32233995248160885,1.361810752768039,0.58186438997537482,3.3632905594766317E-2,0.14780318371714946,0,0.23669952071270942,66.81991404879598,3.8623223894981189,16.973363901056569,0,27.182006498256079]
[null,null,null,null,null,null,null,null,null,null,null,null,null,null,null,null,null,null,null,null,null,null,null,null,null,null,null,null,29,-1.3127653191674052E-5,1.3127653191674052E-5,-1.2329563866839954,1.2329563866839954,-1.4804186264827488E-2,-1.1321494483034609,29,1,0,0,0,1,1,2.5000000000000001E-3,null,2,7.6863375370698566E-7,0.9993483107757094,6.5092049053691993E-4,0,1,0,null,null,null,null,0.20257654874905273,5.0644137187263181E-4,null,null,null,null,null,null,null,null,1,1,1,1,1,1,1,1,null,1,5.0644137187263181E-4,null,null,null,{"$f":"CB$149*(H$16+($BW224*MMULT($AD224:$AH224,CC$3:CC$7)))","v":-0.2326711811871176},-3.0834665421342402,-1.6030741709578742,0,-1.1321494483034609,0.79241409135121477,4.5800212774825544E-2,0.20127680661994538,0,0.32233965883040067,1.3618307695763863,0.58187412786810844,3.3631354055153453E-2,0.14779869211102856,0,0.23669582596570957,66.821032325093157,3.8621442144020639,16.972848095758788,0,27.181582202352747]
[null,null,null,null,null,null,null,null,null,null,null,null,null,null,null,null,null,null,null,null,null,null,null,null,null,null,null,null,31,-6.3952839195936155E-4,6.3952839195936155E-4,-1.2313225637866327,1.2313225637866327,-1.4804186264827488E-2,-1.132014589991351,31,1,0,0,0,1,1,2.5000000000000001E-3,null,2,9.0375666662122754E-6,0.99132004904746962,8.6709132858641558E-3,0,1,0,null,null,null,null,0.20257654874905273,5.0644137187263181E-4,null,null,null,null,null,null,null,null,1,1,1,1,1,1,1,1,null,1,5.0644137187263181E-4,null,null,null,{"$f":"CB$149*(H$16+($BW225*MMULT($AD225:$AH225,CC$3:CC$7)))","v":-0.23493140482324804},-3.0812063184981096,-1.6020667487992792,0,-1.132014589991351,0.79062508083587912,4.5903848574201087E-2,0.20147967950710852,0,0.32238313194400608,1.3603917408611947,0.58117456691950709,3.3743110308168803E-2,0.14810416254038855,0,0.23697816023193566,66.740696419918734,3.8749780350474845,17.007927588826146,0,27.214004793814404]
[null,null,null,null,null,null,null,null,null,null,null,null,null,null,null,null,null,null,null,null,null,null,null,null,null,null,null,null,33,-8.8647040423012922E-6,8.8647040423012922E-6,-1.232964802095363,1.232964802095363,-1.4804186264827487E-2,-1.1321510649814357,33,1,0,0,0,1,1,2.5000000000000001E-3,null,2,1.0570119429419325E-8,0.99969109745649209,3.0889187338848143E-4,0,1,0,null,null,null,null,0.20257654874905273,5.0644137187263181E-4,null,null,null,null,null,null,null,null,1,1,1,1,1,1,1,1,null,1,5.0644137187263181E-4,null,null,null,{"$f":"CB$149*(H$16+($BW226*MMULT($AD226:$AH226,CC$3:CC$7)))","v":-0.23265850282660061},-3.0834792204947563,-1.6030783234200925,0,-1.1321510649814357,0.79242413792643063,4.5799632106897234E-2,0.20127597082734575,0,0.32233913771139505,1.3618388785720688,0.58187804034300483,3.3630727413891726E-2,0.14779719832818253,0,0.23669403391492089,66.821481624347072,3.8620722524192215,16.972676553311615,0,27.181376407528845]
[null,null,null,null,null,null,null,null,null,null,null,null,null,null,null,null,null,null,null,null,null,null,null,null,null,null,null,null,40,-4.2992452819627606E-3,4.2992452819627606E-3,-1.2226192667818416,1.2226192667818416,-1.4804186264827488E-2,-1.131008954308923,40,1,0,0,0,1,1,2.5000000000000001E-3,null,2,4.5736645906347599E-4,0.96185599445865977,3.7686638982276706E-2,0,1,0,null,null,null,null,0.20257654874905273,5.0644137187263181E-4,null,null,null,null,null,null,null,null,1,1,1,1,1,1,1,1,null,1,5.0644137187263181E-4,null,null,null,{"$f":"CB$149*(H$16+($BW227*MMULT($AD227:$AH227,CC$3:CC$7)))","v":-0.24729441871804259},-3.0688433046033152,-1.5970231686844916,0,-1.131008954308923,0.78091074494202151,4.6474881059999022E-2,0.20249842531571052,0,0.3227074949930942,1.3525915463108251,0.57734409702023115,3.4359878402876777E-2,0.14971143791932029,0,0.23858458665757187,66.300814423622398,3.9458062070175388,17.192503246871677,0,27.398482960095155]
[null,null,null,null,null,null,null,null,null,null,null,null,null,null,null,null,null,null,null,null,null,null,null,null,null,null,null,null,43,-7.4322069030271316E-3,7.4322069030271316E-3,-1.2136490353562874,1.2136490353562874,-1.4804186264827487E-2,-1.1305409128266783,43,1,0,0,0,1,1,2.5000000000000001E-3,null,2,1.427961693559466E-4,0.94748427490258724,5.2372928828056782E-2,0,1,0,null,null,null,null,0.20257654874905273,5.0644137187263181E-4,null,null,null,null,null,null,null,null,1,1,1,1,1,1,1,1,null,1,5.0644137187263181E-4,null,null,null,{"$f":"CB$149*(H$16+($BW228*MMULT($AD228:$AH228,CC$3:CC$7)))","v":-0.25939761176466081},-3.0567401115566963,-1.5911858988800016,0,-1.1305409128266783,0.77151619813214478,4.7040793281490523E-2,0.20368391991900606,0,0.32285857083950587,1.3450994821721474,0.57357556698055834,3.4971980812546467E-2,0.1514266584878057,0,0.24002579371908944,65.86804545257074,4.0160985828835383,17.389475072155179,0,27.563987729997294]
[null,null,null,null,null,null,null,null,null,null,null,null,null,null,null,null,null,null,null,null,null,null,null,null,null,null,null,null,63,-7.2208895154333318E-5,7.2208895154333318E-5,-1.2328110564619184,1.2328110564619184,-1.4804186264827487E-2,-1.1321344615486986,63,1,0,0,0,1,1,2.5000000000000001E-3,null,2,3.9303862578008859E-6,0.99852048179754405,1.4755877161981832E-3,0,1,0,null,null,null,null,0.20257654874905273,5.0644137187263181E-4,null,null,null,null,null,null,null,null,1,1,1,1,1,1,1,1,null,1,5.0644137187263181E-4,null,null,null,{"$f":"CB$149*(H$16+($BW229*MMULT($AD229:$AH229,CC$3:CC$7)))","v":-0.2328755926511572},-3.0832621306701999,-1.6029879219777599,0,-1.1321344615486986,0.79225212938068179,4.5809575820296516E-2,0.2012941672878962,0,0.32234448969201712,1.3617003621808916,0.58181091184540423,3.364145085995876E-2,0.14782559576139392,0,0.23672204153324305,66.813772748332013,3.8633037073026117,16.97593764658194,0,27.184592735390183]
[null,null,null,null,null,null,null,null,null,null,null,null,null,null,null,null,null,null,null,null,null,null,null,null,null,null,null,null,67,-2.0999201033256397E-5,2.0999201033256397E-5,-1.2329328241348225,1.2329328241348225,-1.4804186264827487E-2,-1.1321485373045614,67,1,0,0,0,1,1,2.5000000000000001E-3,null,2,2.3908361978970135E-8,0.9995347788210075,4.6519717063049989E-4,0,1,0,null,null,null,null,0.20257654874905273,5.0644137187263181E-4,null,null,null,null,null,null,null,null,1,1,1,1,1,1,1,1,null,1,5.0644137187263181E-4,null,null,null,{"$f":"CB$149*(H$16+($BW230*MMULT($AD230:$AH230,CC$3:CC$7)))","v":-0.23270261528413183},-3.0834351080372251,-1.6030584799565428,0,-1.1321485373045614,0.79238918292128091,4.5801652485785112E-2,0.20127996487936406,0,0.32233995248160885,1.361810752768039,0.58186438997537482,3.3632905594766317E-2,0.14780318371714946,0,0.23669952071270942,66.81991404879598,3.8623223894981189,16.973363901056569,0,27.182006498256079]
[null,null,null,null,null,null,null,null,null,null,null,null,null,null,null,null,null,null,null,null,null,null,null,null,null,null,null,null,69,-1.7061292223242894E-3,1.7061292223242894E-3,-1.230086198632933,1.230086198632933,-1.4804186264827487E-2,-1.1313853921321149,69,1,0,0,0,1,1,2.5000000000000001E-3,null,2,6.507417731398651E-4,0.98125653579620309,1.8092722330657077E-2,0,1,0,null,null,null,null,0.20257654874905273,5.0644137187263181E-4,null,null,null,null,null,null,null,null,1,1,1,1,1,1,1,1,null,1,5.0644137187263181E-4,null,null,null,{"$f":"CB$149*(H$16+($BW231*MMULT($AD231:$AH231,CC$3:CC$7)))","v":-0.23723437080731258},-3.0789033525140446,-1.6018969844759445,0,-1.1313853921321149,0.78880639316029921,4.6009685398531487E-2,0.20151388647204471,0,0.32258603854798545,1.358916003578861,0.58046736596146276,3.3857637467922745E-2,0.14829017094605906,0,0.23738482562455529,66.659483154343661,3.8881300599915356,17.029288348985027,0,27.260705274286515]
[null,null,null,null,null,null,null,null,null,null,null,null,null,null,null,null,null,null,null,null,null,null,null,null,null,null,null,null,73,-3.0776699065080486E-5,3.0776699065080486E-5,-1.2329131562581224,1.2329131562581224,-1.4804186264827485E-2,-1.1321449239857846,73,1,0,0,0,1,1,2.5000000000000001E-3,null,2,1.7382561855161649E-6,0.99901813334578504,9.8012829802944295E-4,0,1,0,null,null,null,null,0.20257654874905273,5.0644137187263181E-4,null,null,null,null,null,null,null,null,1,1,1,1,1,1,1,1,null,1,5.0644137187263181E-4,null,null,null,{"$f":"CB$149*(H$16+($BW232*MMULT($AD232:$AH232,CC$3:CC$7)))","v":-0.23273206065886365},-3.0834056626624928,-1.6030485895778745,0,-1.1321449239857846,0.79236585106836555,4.580300115246181E-2,0.20128195562427967,0,0.32234111720071595,1.361791925045823,0.58185530145635367,3.3634360954901812E-2,0.1478066890560441,0,0.23670364853270037,66.818870345021892,3.8624895195731659,16.973766445786385,0,27.182480527225298]
[null,null,null,null,null,null,null,null,null,null,null,null,null,null,null,null,null,null,null,null,null,null,null,null,null,null,null,null,79,-2.2962806094084913E-5,2.2962806094084913E-5,-1.2329283716229986,1.2329283716229986,-1.4804186264827487E-2,-1.1321479415842375,79,1,0,0,0,1,1,2.5000000000000001E-3,null,2,2.4355321296554899E-7,0.99908169952208059,9.1805682470649547E-4,0,1,0,null,null,null,null,0.20257654874905273,5.0644137187263181E-4,null,null,null,null,null,null,null,null,1,1,1,1,1,1,1,1,null,1,5.0644137187263181E-4,null,null,null,{"$f":"CB$149*(H$16+($BW233*MMULT($AD233:$AH233,CC$3:CC$7)))","v":-0.23270903140101673},-3.0834286919203402,-1.6030559910497799,0,-1.1321479415842375,0.79238409887597483,4.5801946355483729E-2,0.20128046584705334,0,0.32234014450612697,1.3618066555846389,0.58186240728555949,3.3633222578002775E-2,0.14780399627334864,0,0.23670037386308906,66.819686361442493,3.8623587910944015,16.973457213065906,0,27.182104472003953]
[null,null,null,null,null,null,null,null,null,null,null,null,null,null,null,null,null,null,null,null,null,null,null,null,null,null,null,null,95,-1.0901346265774415E-5,1.0901346265774415E-5,-1.2329596910571921,1.2329596910571921,-1.4804186264827487E-2,-1.1321505745293932,95,1,0,0,0,1,1,2.5000000000000001E-3,null,2,7.5442894062953125E-8,0.99967013378118685,3.2979067591911077E-4,0,1,0,null,null,null,null,0.20257654874905273,5.0644137187263181E-4,null,null,null,null,null,null,null,null,1,1,1,1,1,1,1,1,null,1,5.0644137187263181E-4,null,null,null,{"$f":"CB$149*(H$16+($BW234*MMULT($AD234:$AH234,CC$3:CC$7)))","v":-0.23266565050699484},-3.0834720728143621,-1.6030752490241449,0,-1.1321505745293932,0.79241847395219822,4.5799959469199646E-2,0.20127658963032605,0,0.32233929580332232,1.3618343188550464,0.5818758295197165,3.3631080400224951E-2,0.14779814757462426,0,0.23669494250543419,66.821227738691505,3.8621127885249753,16.972785562501283,0,27.181480747888987]
[null,null,null,null,null,null,null,null,null,null,null,null,null,null,null,null,null,null,null,null,null,null,null,null,null,null,null,null,99,-1.6255721255941766E-3,1.6255721255941766E-3,-1.2313065298865475,1.2313065298865475,-1.4804186264827487E-2,-1.1311415773468283,99,1,0,0,0,1,1,2.5000000000000001E-3,null,2,9.1611050977963629E-4,0.99048949589291124,8.5943934973091614E-3,0,1,0,null,null,null,null,0.20257654874905273,5.0644137187263181E-4,null,null,null,null,null,null,null,null,1,1,1,1,1,1,1,1,null,1,5.0644137187263181E-4,null,null,null,{"$f":"CB$149*(H$16+($BW235*MMULT($AD235:$AH235,CC$3:CC$7)))","v":-0.23593348245696788},-3.080204240864389,-1.6030367586328289,0,-1.1311415773468283,0.78983320995003103,4.5949870849254087E-2,0.20128433699412224,0,0.32266469938265807,1.3597321171760655,0.58087412952367523,3.3793326103588865E-2,0.14803234729216802,0,0.23730019708056782,66.706194908376872,3.8807446968189709,16.999680497586052,0,27.250986734824846]
[null,null,null,null,null,null,null,null,null,null,null,null,null,null,null,null,null,null,null,null,null,null,null,null,null,null,null,null,101,-1.5092488219928097,1.5092488219928097,3.3249753944237487E-2,-3.3249753944237487E-2,-1.4804186264827487E-2,-0.11691005482121626,101,1,0,0,0,1,1,2.5000000000000001E-3,null,1,0.99971328508176638,5.2200609294716845E-7,2.8619281214070316E-4,1,0,0,null,null,null,null,0.20257654874905273,5.0644137187263181E-4,null,null,null,null,null,null,null,null,1,1,1,1,1,1,1,1,null,1,5.0644137187263181E-4,null,null,null,{"$f":"CB$149*(H$16+($BW236*MMULT($AD236:$AH236,CC$3:CC$7)))","v":-3.0081130161549687},-0.30802470716638863,-1.8461037246692593,0,-0.11691005482121626,4.9384779173840349E-2,0.73489716055833565,0.157851000663078,0,0.88966521066119386,1.8317981510564478,2.6959727601733194E-2,0.40118894111477321,8.6172704439100467E-2,0,0.48567862684439317,3.0959905987768113,46.071577887334094,9.8958671525107107,0,55.774171198985144]
[null,null,null,null,null,null,null,null,null,null,null,null,null,null,null,null,null,null,null,null,null,null,null,null,null,null,null,null,104,-1.5092488219928097,1.5092488219928097,3.3249753944237487E-2,-3.3249753944237487E-2,-1.4804186264827487E-2,-0.11691005482121626,104,1,0,0,0,1,1,2.5000000000000001E-3,null,1,0.99971328508176638,5.2200609294716983E-7,2.8619281214070343E-4,1,0,0,null,null,null,null,0.20257654874905273,5.0644137187263181E-4,null,null,null,null,null,null,null,null,1,1,1,1,1,1,1,1,null,1,5.0644137187263181E-4,null,null,null,{"$f":"CB$149*(H$16+($BW237*MMULT($AD237:$AH237,CC$3:CC$7)))","v":-3.0081130161549687},-0.30802470716638863,-1.8461037246692593,0,-0.11691005482121626,4.9384779173840349E-2,0.73489716055833565,0.157851000663078,0,0.88966521066119386,1.8317981510564478,2.6959727601733194E-2,0.40118894111477321,8.6172704439100467E-2,0,0.48567862684439317,3.0959905987768113,46.071577887334094,9.8958671525107107,0,55.774171198985144]
[null,null,null,null,null,null,null,null,null,null,null,null,null,null,null,null,null,null,null,null,null,null,null,null,null,null,null,null,108,-1.4345223617968679,1.4345223617968679,1.7358996535245213E-3,-1.7358996535245213E-3,-1.4804186264827487E-2,-0.17523781848500558,108,1,0,0,0,1,1,2.5000000000000001E-3,null,1,0.92766079550136071,9.6292321177475389E-3,6.2709972280891743E-2,1,0,0,null,null,null,null,0.20257654874905273,5.0644137187263181E-4,null,null,null,null,null,null,null,null,1,1,1,1,1,1,1,1,null,1,5.0644137187263181E-4,null,null,null,{"$f":"CB$149*(H$16+($BW238*MMULT($AD238:$AH238,CC$3:CC$7)))","v":-2.9018727016683137},-0.41426502165304346,-1.8028911187640304,0,-0.17523781848500558,5.4920274403745313E-2,0.66082579491228299,0.16482167966987313,0,0.83925740610926958,1.7198251550951711,3.1933638277727223E-2,0.38424010310264034,9.5836300092233664E-2,0,0.48798995852739868,3.6671825974319883,44.12521389134249,11.005611350762825,0,56.039598998069437]
[null,null,null,null,null,null,null,null,null,null,null,null,null,null,null,null,null,null,null,null,null,null,null,null,null,null,null,null,109,-1.503391803121048,1.503391803121048,3.2369714151826219E-2,-3.2369714151826219E-2,-1.4804186264827487E-2,-0.12189279434404633,109,1,0,0,0,1,1,2.5000000000000001E-3,null,1,0.99403109218907382,1.9782710213219382E-4,5.7710806087940035E-3,1,0,0,null,null,null,null,0.20257654874905273,5.0644137187263181E-4,null,null,null,null,null,null,null,null,1,1,1,1,1,1,1,1,null,1,5.0644137187263181E-4,null,null,null,{"$f":"CB$149*(H$16+($BW239*MMULT($AD239:$AH239,CC$3:CC$7)))","v":-3.0013759574907954},-0.3147617658305617,-1.841126745589909,0,-0.12189279434404633,4.9718610586497666E-2,0.72996275562680157,0.15863858004837914,0,0.88524326650079888,1.8235632127624772,2.7264539138832481E-2,0.40029473643581376,8.6993737830486778E-2,0,0.48544698659486701,3.1309944262337859,45.968889561979395,9.990152662311278,0,55.747570187082296]
[null,null,null,null,null,null,null,null,null,null,null,null,null,null,null,null,null,null,null,null,null,null,null,null,null,null,null,null,112,-1.5093958817637134,1.5093958817637134,3.3256149822662007E-2,-3.3256149822662007E-2,-1.4804186264827487E-2,-0.11678088789244533,112,1,0,0,0,1,1,2.5000000000000001E-3,null,1,0.99975304596028314,1.6160753581677104E-7,2.4679233218100402E-4,1,0,0,null,null,null,null,0.20257654874905273,5.0644137187263181E-4,null,null,null,null,null,null,null,null,1,1,1,1,1,1,1,1,null,1,5.0644137187263181E-4,null,null,null,{"$f":"CB$149*(H$16+($BW240*MMULT($AD240:$AH240,CC$3:CC$7)))","v":-3.0082664718042968},-0.30787125151706052,-1.8462443885617386,0,-0.11678088789244533,4.9377201381927659E-2,0.73500994333265413,0.15782879828846583,0,0.88978013340603856,1.8319960764090863,2.6952678566163964E-2,0.40120716021038344,8.6151275278835537E-2,0,0.48568888594461701,3.095181104401528,46.073670124672716,9.893406279029346,0,55.77534932950315]
[null,null,null,null,null,null,null,null,null,null,null,null,null,null,null,null,null,null,null,null,null,null,null,null,null,null,null,null,113,-1.4737548885588585,1.4737548885588585,9.0726317787655202E-3,-9.0726317787655202E-3,-1.4804186264827487E-2,-0.14223429893988293,113,1,0,0,0,1,1,2.5000000000000001E-3,null,1,0.97253562470282173,1.0335452560561589E-2,1.7128922636616677E-2,1,0,0,null,null,null,null,0.20257654874905273,5.0644137187263181E-4,null,null,null,null,null,null,null,null,1,1,1,1,1,1,1,1,null,1,5.0644137187263181E-4,null,null,null,{"$f":"CB$149*(H$16+($BW241*MMULT($AD241:$AH241,CC$3:CC$7)))","v":-2.9484419605555452},-0.36769576276581195,-1.8347869134007802,0,-0.14223429893988293,5.2421316834792127E-2,0.69232778154035524,0.159647516890354,0,0.86741799755790505,1.7718146128234065,2.9586231231752948E-2,0.39074504551981493,9.0103962194980375E-2,0,0.4895647610534517,3.3976119899985666,44.872225911147261,10.34732338505774,0,56.220445551403181]
[null,null,null,null,null,null,null,null,null,null,null,null,null,null,null,null,null,null,null,null,null,null,null,null,null,null,null,null,115,-1.5091762356373934,1.5091762356373934,3.3176242848857798E-2,-3.3176242848857798E-2,-1.4804186264827487E-2,-0.11695562181158664,115,1,0,0,0,1,1,2.5000000000000001E-3,null,1,0.99885705715435213,1.9505101565816555E-5,1.1234376440820836E-3,1,0,0,null,null,null,null,0.20257654874905273,5.0644137187263181E-4,null,null,null,null,null,null,null,null,1,1,1,1,1,1,1,1,null,1,5.0644137187263181E-4,null,null,null,{"$f":"CB$149*(H$16+($BW242*MMULT($AD242:$AH242,CC$3:CC$7)))","v":-3.0079669187041724},-0.30817080461718471,-1.8461046494092228,0,-0.11695562181158664,4.9391994691257303E-2,0.73478980179919229,0.1578508546920169,0,0.88962467221872132,1.8316573234011879,2.6965739748492777E-2,0.4011611737695388,8.6179250166131011E-2,0,0.48569383631583735,3.0966810193226384,46.068389151859137,9.8966188481379085,0,55.775917818287063]
[null,null,null,null,null,null,null,null,null,null,null,null,null,null,null,null,null,null,null,null,null,null,null,null,null,null,null,null,117,-1.5057456802346763,1.5057456802346763,3.3120055804273546E-2,-3.3120055804273546E-2,-1.4804186264827487E-2,-0.11999282526396017,117,1,0,0,0,1,1,2.5000000000000001E-3,null,1,0.99808617244336761,3.7197666863505133E-6,1.9101076899460329E-3,1,0,0,null,null,null,null,0.20257654874905273,5.0644137187263181E-4,null,null,null,null,null,null,null,null,1,1,1,1,1,1,1,1,null,1,5.0644137187263181E-4,null,null,null,{"$f":"CB$149*(H$16+($BW243*MMULT($AD243:$AH243,CC$3:CC$7)))","v":-3.0044801762568709},-0.31165754706448623,-1.8427302810510899,0,-0.11999282526396017,4.9564512443408683E-2,0.73223224037750179,0.15838440130653789,0,0.88692680016000724,1.8271079542874555,2.7127303740921042E-2,0.40076024991257908,8.6685847398822916E-2,0,0.48542659894767698,3.1152346415642294,46.022348015601786,9.9547952619708013,0,55.745228918469941]
[null,null,null,null,null,null,null,null,null,null,null,null,null,null,null,null,null,null,null,null,null,null,null,null,null,null,null,null,119,-1.5091202624756672,1.5091202624756672,3.3232590330286055E-2,-3.3232590330286055E-2,-1.4804186264827487E-2,-0.11701998078655712,119,1,0,0,0,1,1,2.5000000000000001E-3,null,1,0.99949781972128804,3.8137396250310883E-6,4.9836643908689096E-4,1,0,0,null,null,null,null,0.20257654874905273,5.0644137187263181E-4,null,null,null,null,null,null,null,null,1,1,1,1,1,1,1,1,null,1,5.0644137187263181E-4,null,null,null,{"$f":"CB$149*(H$16+($BW244*MMULT($AD244:$AH244,CC$3:CC$7)))","v":-3.0079672930238743},-0.30817043029748259,-1.8459923287660682,0,-0.11701998078655712,4.9391976202864028E-2,0.73479007684554343,0.15786858559729311,0,0.88956741872911649,1.8316180573748171,2.6966307743032148E-2,0.40116992398441836,8.6190778127378617E-2,0,0.48567299014517085,3.0967462464562363,46.069394005595228,9.897942691619301,0,55.773523893935987]
[null,null,null,null,null,null,null,null,null,null,null,null,null,null,null,null,null,null,null,null,null,null,null,null,null,null,null,null,120,-1.5088406939880887,1.5088406939880887,3.3040957816924163E-2,-3.3040957816924163E-2,-1.4804186264827487E-2,-0.11721913707383816,120,1,0,0,0,1,1,2.5000000000000001E-3,null,1,0.9986344519879865,6.2991602224493994E-5,1.3025563097890009E-3,1,0,0,null,null,null,null,0.20257654874905273,5.0644137187263181E-4,null,null,null,null,null,null,null,null,1,1,1,1,1,1,1,1,null,1,5.0644137187263181E-4,null,null,null,{"$f":"CB$149*(H$16+($BW245*MMULT($AD245:$AH245,CC$3:CC$7)))","v":-3.0074960920229339},-0.30864163129842304,-1.8459043927918517,0,-0.11721913707383816,4.9415255235610293E-2,0.73444392458590302,0.1578824685355617,0,0.88939027342510235,1.8311319217821773,2.6986179776450042E-2,0.40108739072774952,8.6221241985613012E-2,0,0.48570518751018749,3.0990283032169446,46.059916083914857,9.9014410881939785,0,55.777221362280976]
[null,null,null,null,null,null,null,null,null,null,null,null,null,null,null,null,null,null,null,null,null,null,null,null,null,null,null,null,123,-1.5060348552842462,1.5060348552842462,3.3148268475465974E-2,-3.3148268475465974E-2,-1.4804186264827487E-2,-0.11974287645832488,123,1,0,0,0,1,1,2.5000000000000001E-3,null,1,0.99926872125105437,2.2528020521905015E-7,7.3105336874037608E-4,1,0,0,null,null,null,null,0.20257654874905273,5.0644137187263181E-4,null,null,null,null,null,null,null,null,1,1,1,1,1,1,1,1,null,1,5.0644137187263181E-4,null,null,null,{"$f":"CB$149*(H$16+($BW246*MMULT($AD246:$AH246,CC$3:CC$7)))","v":-3.0047975639776334},-0.31134015934372372,-1.8429912434294673,0,-0.11974287645832488,4.9548783771949191E-2,0.73246467878394084,0.15834307432910275,0,0.88714851416181384,1.8275050510468067,2.7112802639624622E-2,0.40080035804244718,8.6644397638410253E-2,0,0.48544244167951789,3.1135693697948392,46.026953937250568,9.9500352706810187,0,55.747048259880316]
[null,null,null,null,null,null,null,null,null,null,null,null,null,null,null,null,null,null,null,null,null,null,null,null,null,null,null,null,127,-1.5092488219928097,1.5092488219928097,3.3249753944237487E-2,-3.3249753944237487E-2,-1.4804186264827487E-2,-0.11691005482121625,127,1,0,0,0,1,1,2.5000000000000001E-3,null,1,0.99971328508176638,5.2200609294717078E-7,2.8619281214070343E-4,1,0,0,null,null,null,null,0.20257654874905273,5.0644137187263181E-4,null,null,null,null,null,null,null,null,1,1,1,1,1,1,1,1,null,1,5.0644137187263181E-4,null,null,null,{"$f":"CB$149*(H$16+($BW247*MMULT($AD247:$AH247,CC$3:CC$7)))","v":-3.0081130161549687},-0.30802470716638863,-1.8461037246692593,0,-0.11691005482121625,4.9384779173840349E-2,0.73489716055833565,0.157851000663078,0,0.88966521066119397,1.8317981510564478,2.6959727601733194E-2,0.40118894111477321,8.6172704439100467E-2,0,0.48567862684439322,3.0959905987768113,46.071577887334094,9.8958671525107107,0,55.774171198985144]
[null,null,null,null,null,null,null,null,null,null,null,null,null,null,null,null,null,null,null,null,null,null,null,null,null,null,null,null,128,-1.5093958817637134,1.5093958817637134,3.3256149822662007E-2,-3.3256149822662007E-2,-1.4804186264827487E-2,-0.11678088789244533,128,1,0,0,0,1,1,2.5000000000000001E-3,null,1,0.99975304596028314,1.6160753581677074E-7,2.4679233218100359E-4,1,0,0,null,null,null,null,0.20257654874905273,5.0644137187263181E-4,null,null,null,null,null,null,null,null,1,1,1,1,1,1,1,1,null,1,5.0644137187263181E-4,null,null,null,{"$f":"CB$149*(H$16+($BW248*MMULT($AD248:$AH248,CC$3:CC$7)))","v":-3.0082664718042968},-0.30787125151706052,-1.8462443885617386,0,-0.11678088789244533,4.9377201381927659E-2,0.73500994333265413,0.15782879828846583,0,0.88978013340603856,1.8319960764090863,2.6952678566163964E-2,0.40120716021038344,8.6151275278835537E-2,0,0.48568888594461701,3.095181104401528,46.073670124672716,9.893406279029346,0,55.77534932950315]
[null,null,null,null,null,null,null,null,null,null,null,null,null,null,null,null,null,null,null,null,null,null,null,null,null,null,null,null,132,-1.5092488219928097,1.5092488219928097,3.3249753944237487E-2,-3.3249753944237487E-2,-1.4804186264827487E-2,-0.11691005482121625,132,1,0,0,0,1,1,2.5000000000000001E-3,null,1,0.99971328508176638,5.2200609294716898E-7,2.8619281214070289E-4,1,0,0,null,null,null,null,0.20257654874905273,5.0644137187263181E-4,null,null,null,null,null,null,null,null,1,1,1,1,1,1,1,1,null,1,5.0644137187263181E-4,null,null,null,{"$f":"CB$149*(H$16+($BW249*MMULT($AD249:$AH249,CC$3:CC$7)))","v":-3.0081130161549687},-0.30802470716638863,-1.8461037246692593,0,-0.11691005482121625,4.9384779173840349E-2,0.73489716055833565,0.157851000663078,0,0.88966521066119397,1.8317981510564478,2.6959727601733194E-2,0.40118894111477321,8.6172704439100467E-2,0,0.48567862684439322,3.0959905987768113,46.071577887334094,9.8958671525107107,0,55.774171198985144]
[null,null,null,null,null,null,null,null,null,null,null,null,null,null,null,null,null,null,null,null,null,null,null,null,null,null,null,null,134,-1.5075177564499318,1.5075177564499318,3.2044200664903266E-2,-3.2044200664903266E-2,-1.4804186264827487E-2,-0.11813830779895951,134,1,0,0,0,1,1,2.5000000000000001E-3,null,1,0.99727468813271647,4.5968463316409616E-4,2.2656271341194361E-3,1,0,0,null,null,null,null,0.20257654874905273,5.0644137187263181E-4,null,null,null,null,null,null,null,null,1,1,1,1,1,1,1,1,null,1,5.0644137187263181E-4,null,null,null,{"$f":"CB$149*(H$16+($BW250*MMULT($AD250:$AH250,CC$3:CC$7)))","v":-3.0051763973327565},-0.31096132598860082,-1.8455782124057156,0,-0.11813830779895951,4.9530016594991351E-2,0.73274221340207968,0.15793397509987159,0,0.8885731475191988,1.8287793526161416,2.7083648185406671E-2,0.40067283806210019,8.6360322733270559E-2,0,0.4858831910192225,3.110221342043793,46.012309847883536,9.9174127884121575,0,55.797662859267255]
[null,null,null,null,null,null,null,null,null,null,null,null,null,null,null,null,null,null,null,null,null,null,null,null,null,null,null,null,135,-1.5093476725034227,1.5093476725034227,3.3255154932580112E-2,-3.3255154932580112E-2,-1.4804186264827487E-2,-0.11682351634290747,135,1,0,0,0,1,1,2.5000000000000001E-3,null,1,0.99983559417431733,7.1442990138948797E-8,1.6433428269247344E-4,1,0,0,null,null,null,null,0.20257654874905273,5.0644137187263181E-4,null,null,null,null,null,null,null,null,1,1,1,1,1,1,1,1,null,1,5.0644137187263181E-4,null,null,null,{"$f":"CB$149*(H$16+($BW251*MMULT($AD251:$AH251,CC$3:CC$7)))","v":-3.0082172676539241},-0.30792045566743309,-1.8461971741915297,0,-0.11682351634290747,4.937963100494272E-2,0.73497377868260971,0.15783625025169631,0,0.88974220426613548,1.8319318642053841,2.6954949564328666E-2,0.40120148191287169,8.6158362838543195E-2,0,0.48568520568425655,3.0954419003958948,46.073018042575555,9.8942201974244917,0,55.774926697210816]
[null,null,null,null,null,null,null,null,null,null,null,null,null,null,null,null,null,null,null,null,null,null,null,null,null,null,null,null,137,-1.3063394542112383,1.3063394542112383,2.6221581368607461E-2,-2.6221581368607461E-2,-1.4804186264827487E-2,-0.29559580676542685,137,1,0,0,0,1,1,2.5000000000000001E-3,null,1,0.95777086338432904,1.1477834008431587E-4,4.2114358175586654E-2,1,0,0,null,null,null,null,0.20257654874905273,5.0644137187263181E-4,null,null,null,null,null,null,null,null,1,1,1,1,1,1,1,1,null,1,5.0644137187263181E-4,null,null,null,{"$f":"CB$149*(H$16+($BW252*MMULT($AD252:$AH252,CC$3:CC$7)))","v":-2.798175475797767},-0.5179622475235901,-1.6502225294633179,0,-0.29559580676542685,6.092111333276249E-2,0.59573326888197242,0.19200717661240027,0,0.74408812263181601,1.5927496814589512,3.8249019316681974E-2,0.37402818271875815,0.120550754991533,0,0.46717204297302684,4.392425842213151,42.952501393241285,13.843760205694327,0,53.648919396457984]
[null,null,null,null,null,null,null,null,null,null,null,null,null,null,null,null,null,null,null,null,null,null,null,null,null,null,null,null,138,-1.5053688534167771,1.5053688534167771,3.3119130180877331E-2,-3.3119130180877331E-2,-1.4804186264827487E-2,-0.12032780085946231,138,1,0,0,0,1,1,2.5000000000000001E-3,null,1,0.99872574051568852,1.6453415387905927E-6,1.2726140427727394E-3,1,0,0,null,null,null,null,0.20257654874905273,5.0644137187263181E-4,null,null,null,null,null,null,null,null,1,1,1,1,1,1,1,1,null,1,5.0644137187263181E-4,null,null,null,{"$f":"CB$149*(H$16+($BW253*MMULT($AD253:$AH253,CC$3:CC$7)))","v":-3.0041024238155756},-0.31203529950578157,-1.8423543798565869,0,-0.12032780085946231,4.9583239095782432E-2,0.73195569009816419,0.15844394938357512,0,0.8866297510818304,1.8266126296593521,2.7144912003060708E-2,0.40071752390908838,8.6741954375473454E-2,0,0.4853956097123775,3.1172567322489182,46.017441463611171,9.961238452896243,0,55.741670188850421]
[null,null,null,null,null,null,null,null,null,null,null,null,null,null,null,null,null,null,null,null,null,null,null,null,null,null,null,null,142,-1.5049220896817643,1.5049220896817643,3.2994571276601131E-2,-3.2994571276601131E-2,-1.4804186264827487E-2,-0.12069302914779335,142,1,0,0,0,1,1,2.5000000000000001E-3,null,1,0.99665072786794773,2.7143117664745407E-5,3.3221289143874904E-3,1,0,0,null,null,null,null,{"$f":"$BC$222/$BB$222","v":0.20257654874905273},5.0644137187263181E-4,null,null,null,null,null,null,null,null,1,1,1,1,1,1,1,1,null,1,5.0644137187263181E-4,null,null,null,{"$f":"CB$149*(H$16+($BW254*MMULT($AD254:$AH254,CC$3:CC$7)))","v":-3.0035311011762866},-0.31260662214507051,-1.8420321750258504,0,-0.12069302914779335,4.9611575216570024E-2,0.73153762667737487,0.15849500901485566,0,0.88630598794278692,1.8259501988515874,2.7170278383152353E-2,0.40063394233723787,8.6801386540848416E-2,0,0.48539439273876145,3.1201697466327754,46.007843155924142,9.968063500537081,0,55.741530434512775]
[null,null,null,null,null,null,null,null,null,null,null,null,null,null,null,null,null,null,null,null,null,null,null,null,null,null,null,null,148,-1.503391803121048,1.503391803121048,3.2369714151826219E-2,-3.2369714151826219E-2,-1.4804186264827487E-2,-0.12189279434404633,148,1,0,0,0,1,1,2.5000000000000001E-3,null,1,0.99403109218907382,1.9782710213219417E-4,5.7710806087940139E-3,1,0,0,null,null,null,null,0.20257654874905273,5.0644137187263181E-4,null,null,null,null,null,null,null,null,1,1,1,1,1,1,1,1,null,1,5.0644137187263181E-4,null,null,null,{"$f":"CB$149*(H$16+($BW255*MMULT($AD255:$AH255,CC$3:CC$7)))","v":-3.0013759574907954},-0.3147617658305617,-1.841126745589909,0,-0.12189279434404633,4.9718610586497666E-2,0.72996275562680157,0.15863858004837914,0,0.88524326650079888,1.8235632127624772,2.7264539138832481E-2,0.40029473643581376,8.6993737830486778E-2,0,0.48544698659486701,3.1309944262337859,45.968889561979395,9.990152662311278,0,55.747570187082296]
[null,null,null,null,null,null,null,null,null,null,null,null,null,null,null,null,null,null,null,null,null,null,null,null,null,null,null,null,149,-1.5093845873581657,1.5093845873581657,3.3256762514902408E-2,-3.3256762514902408E-2,-1.4804186264827487E-2,-0.1167910934795952,149,1,0,0,0,1,1,2.5000000000000001E-3,null,1,0.9999371681519843,4.3221199834884798E-9,6.2827425895749115E-5,1,0,0,null,null,null,null,0.20257654874905273,5.0644137187263181E-4,null,null,null,null,null,null,null,null,1,1,1,1,1,1,1,1,null,1,5.0644137187263181E-4,null,null,null,{"$f":"CB$149*(H$16+($BW256*MMULT($AD256:$AH256,CC$3:CC$7)))","v":-3.0082557900909892},-0.30788193323036772,-1.8462324814639504,0,-0.1167910934795952,4.9377728817853711E-2,0.73500209220909329,0.15783067758258928,0,0.88977105272367985,1.8319815513332163,2.695318016817325E-2,0.40120605563642214,8.6152984165003582E-2,0,0.48568778003040097,3.0952387071758594,46.073543278042429,9.8936025234272424,0,55.77522232896122]
[null,null,null,null,null,null,null,null,null,null,null,null,null,null,null,null,null,null,null,null,null,null,null,null,null,null,null,null,150,-1.476984422839599,1.476984422839599,3.1811990034365419E-2,-3.1811990034365419E-2,-1.4804186264827487E-2,-0.14523990028772094,150,1,0,0,0,1,1,2.5000000000000001E-3,null,1,0.98529667180086267,8.4662963662261341E-5,1.4618665135475054E-2,1,0,0,null,null,null,null,0.20257654874905273,5.0644137187263181E-4,null,null,null,null,null,null,null,null,1,1,1,1,1,1,1,1,null,1,5.0644137187263181E-4,null,null,null,{"$f":"CB$149*(H$16+($BW257*MMULT($AD257:$AH257,CC$3:CC$7)))","v":-2.9744108530918858},-0.34172687022947157,-1.8152770894259207,0,-0.14523990028772094,5.1077517302936193E-2,0.71054224844967961,0.16279279397829491,0,0.86481479890369417,1.789227358634605,2.8547248093676848E-2,0.39712239197589094,9.0984968004583458E-2,0,0.48334539192584869,3.2782976528772809,45.604585116137322,10.448495983842584,0,55.506228084749566]
[null,null,null,null,null,null,null,null,null,null,null,null,null,null,null,null,null,null,null,null,null,null,null,null,null,null,null,null,154,-1.5045454864530086,1.5045454864530086,3.3047041413162115E-2,-3.3047041413162115E-2,-1.4804186264827487E-2,-0.12104160954793187,154,1,0,0,0,1,1,2.5000000000000001E-3,null,1,0.99777353675263414,1.2011877085744559E-5,2.2144512702800701E-3,1,0,0,null,null,null,null,0.20257654874905273,5.0644137187263181E-4,null,null,null,null,null,null,null,null,1,1,1,1,1,1,1,1,null,1,5.0644137187263181E-4,null,null,null,{"$f":"CB$149*(H$16+($BW258*MMULT($AD258:$AH258,CC$3:CC$7)))","v":-3.0032069680840916},-0.31293075523726532,-1.8416031016605336,0,-0.12104160954793187,4.9627658576287384E-2,0.73130054954873014,0.15856302959362534,0,0.88599709288737338,1.8254883306060163,2.718596319912505E-2,0.40060543652226838,8.6860609807889816E-2,0,0.48534799047071669,3.1219709533627684,46.004569616352086,9.9748645587932199,0,55.736201709098673]
[null,null,null,null,null,null,null,null,null,null,null,null,null,null,null,null,null,null,null,null,null,null,null,null,null,null,null,null,156,-1.5093845873581657,1.5093845873581657,3.3256762514902408E-2,-3.3256762514902408E-2,-1.4804186264827487E-2,-0.1167910934795952,156,1,0,0,0,1,1,2.5000000000000001E-3,null,1,0.9999371681519843,4.3221199834884873E-9,6.2827425895749115E-5,1,0,0,null,null,null,null,0.20257654874905273,5.0644137187263181E-4,null,null,null,null,null,null,null,null,1,1,1,1,1,1,1,1,null,1,5.0644137187263181E-4,null,null,null,{"$f":"CB$149*(H$16+($BW259*MMULT($AD259:$AH259,CC$3:CC$7)))","v":-3.0082557900909892},-0.30788193323036772,-1.8462324814639504,0,-0.1167910934795952,4.9377728817853711E-2,0.73500209220909329,0.15783067758258928,0,0.88977105272367985,1.8319815513332163,2.695318016817325E-2,0.40120605563642214,8.6152984165003582E-2,0,0.48568778003040097,3.0952387071758594,46.073543278042429,9.8936025234272424,0,55.77522232896122]
[null,null,null,null,null,null,null,null,null,null,null,null,null,null,null,null,null,null,null,null,null,null,null,null,null,null,null,null,157,-1.3986063329899234,1.3986063329899234,-3.1820189427833066E-2,3.1820189427833066E-2,-1.4804186264827487E-2,-0.19851292621730671,157,1,0,0,0,1,1,2.5000000000000001E-3,null,1,0.8888805948752152,2.0872944618557664E-2,9.0246460406227108E-2,1,0,0,null,null,null,null,0.20257654874905273,5.0644137187263181E-4,null,null,null,null,null,null,null,null,1,1,1,1,1,1,1,1,null,1,5.0644137187263181E-4,null,null,null,{"$f":"CB$149*(H$16+($BW260*MMULT($AD260:$AH260,CC$3:CC$7)))","v":-2.8324005837800117},-0.48373713954134567,-1.8005311790384437,0,-0.19851292621730671,5.8871358273843412E-2,0.6164752275773564,0.16521110823259419,0,0.81994917183072757,1.6605068659145217,3.5453848148601363E-2,0.37125725899232198,9.9494384289464777E-2,0,0.49379450856961182,4.0714350745692958,42.634295143767815,11.425696985583315,0,56.706179633686318]
[null,null,null,null,null,null,null,null,null,null,null,null,null,null,null,null,null,null,null,null,null,null,null,null,null,null,null,null,158,-1.5088406939880887,1.5088406939880887,3.3040957816924163E-2,-3.3040957816924163E-2,-1.4804186264827487E-2,-0.11721913707383816,158,1,0,0,0,1,1,2.5000000000000001E-3,null,1,0.9986344519879865,6.2991602224493832E-5,1.3025563097890022E-3,1,0,0,null,null,null,null,0.20257654874905273,5.0644137187263181E-4,null,null,null,null,null,null,null,null,1,1,1,1,1,1,1,1,null,1,5.0644137187263181E-4,null,null,null,{"$f":"CB$149*(H$16+($BW261*MMULT($AD261:$AH261,CC$3:CC$7)))","v":-3.0074960920229339},-0.30864163129842304,-1.8459043927918517,0,-0.11721913707383816,4.9415255235610293E-2,0.73444392458590302,0.1578824685355617,0,0.88939027342510235,1.8311319217821773,2.6986179776450042E-2,0.40108739072774952,8.6221241985613012E-2,0,0.48570518751018749,3.0990283032169446,46.059916083914857,9.9014410881939785,0,55.777221362280976]
[null,null,null,null,null,null,null,null,null,null,null,null,null,null,null,null,null,null,null,null,null,null,null,null,null,null,null,null,160,-1.5091643924271529,1.5091643924271529,3.3215627901639337E-2,-3.3215627901639337E-2,-1.4804186264827487E-2,-0.1169763389088197,160,1,0,0,0,1,1,2.5000000000000001E-3,null,1,0.99924307161957437,8.625378791743126E-6,7.4830290163390779E-4,1,0,0,null,null,null,null,0.20257654874905273,5.0644137187263181E-4,null,null,null,null,null,null,null,null,1,1,1,1,1,1,1,1,null,1,5.0644137187263181E-4,null,null,null,{"$f":"CB$149*(H$16+($BW262*MMULT($AD262:$AH262,CC$3:CC$7)))","v":-3.0079944605467137},-0.30814326277464366,-1.8460534211462007,0,-0.1169763389088197,4.9390634363449766E-2,0.73481003954290525,0.1578589413242496,0,0.88960624196879734,1.831665857199402,2.6964871441654499E-2,0.40117035356351627,8.6183263559661633E-2,0,0.48568151143516758,3.0965813050433297,46.069443337430776,9.8970797366462637,0,55.774502458486388]
[null,null,null,null,null,null,null,null,null,null,null,null,null,null,null,null,null,null,null,null,null,null,null,null,null,null,null,null,162,-1.5045454864530086,1.5045454864530086,3.3047041413162115E-2,-3.3047041413162115E-2,-1.4804186264827487E-2,-0.12104160954793187,162,1,0,0,0,1,1,2.5000000000000001E-3,null,1,0.99777353675263414,1.2011877085744601E-5,2.214451270280074E-3,1,0,0,null,null,null,null,0.20257654874905273,5.0644137187263181E-4,null,null,null,null,null,null,null,null,1,1,1,1,1,1,1,1,null,1,5.0644137187263181E-4,null,null,null,{"$f":"CB$149*(H$16+($BW263*MMULT($AD263:$AH263,CC$3:CC$7)))","v":-3.0032069680840916},-0.31293075523726532,-1.8416031016605336,0,-0.12104160954793187,4.9627658576287384E-2,0.73130054954873014,0.15856302959362534,0,0.88599709288737338,1.8254883306060163,2.718596319912505E-2,0.40060543652226838,8.6860609807889816E-2,0,0.48534799047071669,3.1219709533627684,46.004569616352086,9.9748645587932199,0,55.736201709098673]
[null,null,null,null,null,null,null,null,null,null,null,null,null,null,null,null,null,null,null,null,null,null,null,null,null,null,null,null,163,-1.5028782737748367,1.5028782737748367,3.1543321794596471E-2,-3.1543321794596471E-2,-1.4804186264827487E-2,-0.12213597973289046,163,1,0,0,0,1,1,2.5000000000000001E-3,null,1,0.9909135034820854,4.461279266176042E-4,8.6403684912970454E-3,1,0,0,null,null,null,null,0.20257654874905273,5.0644137187263181E-4,null,null,null,null,null,null,null,null,1,1,1,1,1,1,1,1,null,1,5.0644137187263181E-4,null,null,null,{"$f":"CB$149*(H$16+($BW264*MMULT($AD264:$AH264,CC$3:CC$7)))","v":-3.0000360357873541},-0.31610168753400281,-1.8414396086009275,0,-0.12213597973289046,4.9785274283981058E-2,0.72898531767923369,0.15858895566778286,0,0.88502801444695134,1.8223875620779491,2.731870833623018E-2,0.40001662261567433,8.7022628428693988E-2,0,0.48564204061940147,3.1372150872272515,45.936951636446125,9.9934703894695005,0,55.769969724463877]
[null,null,null,null,null,null,null,null,null,null,null,null,null,null,null,null,null,null,null,null,null,null,null,null,null,null,null,null,166,-1.5091254271289354,1.5091254271289354,3.3088560339602932E-2,-3.3088560339602932E-2,-1.4804186264827487E-2,-0.11697815227260158,166,1,0,0,0,1,1,2.5000000000000001E-3,null,1,0.99826960853659308,4.4099185287718612E-5,1.6862921781191629E-3,1,0,0,null,null,null,null,0.20257654874905273,5.0644137187263181E-4,null,null,null,null,null,null,null,null,1,1,1,1,1,1,1,1,null,1,5.0644137187263181E-4,null,null,null,{"$f":"CB$149*(H$16+($BW265*MMULT($AD265:$AH265,CC$3:CC$7)))","v":-3.0078284276864595},-0.30830929563489762,-1.8461415234100196,0,-0.11697815227260158,4.9398835512554182E-2,0.73468804705795754,0.15784503420678817,0,0.8896046287905206,1.8315365455678205,2.6971252979961342E-2,0.40113207068450085,8.6181755198257534E-2,0,0.48571492113728021,3.0973141456304298,46.065047023221787,9.8969065200323723,0,55.778339148722161]
[null,null,null,null,null,null,null,null,null,null,null,null,null,null,null,null,null,null,null,null,null,null,null,null,null,null,null,null,168,-1.5091762356373934,1.5091762356373934,3.3176242848857798E-2,-3.3176242848857798E-2,-1.4804186264827487E-2,-0.11695562181158664,168,1,0,0,0,1,1,2.5000000000000001E-3,null,1,0.99885705715435213,1.9505101565816538E-5,1.1234376440820845E-3,1,0,0,null,null,null,null,0.20257654874905273,5.0644137187263181E-4,null,null,null,null,null,null,null,null,1,1,1,1,1,1,1,1,null,1,5.0644137187263181E-4,null,null,null,{"$f":"CB$149*(H$16+($BW266*MMULT($AD266:$AH266,CC$3:CC$7)))","v":-3.0079669187041724},-0.30817080461718471,-1.8461046494092228,0,-0.11695562181158664,4.9391994691257303E-2,0.73478980179919229,0.1578508546920169,0,0.88962467221872132,1.8316573234011879,2.6965739748492777E-2,0.4011611737695388,8.6179250166131011E-2,0,0.48569383631583735,3.0966810193226384,46.068389151859137,9.8966188481379085,0,55.775917818287063]
[null,null,null,null,null,null,null,null,null,null,null,null,null,null,null,null,null,null,null,null,null,null,null,null,null,null,null,null,171,-1.5092488219928097,1.5092488219928097,3.3249753944237487E-2,-3.3249753944237487E-2,-1.4804186264827487E-2,-0.11691005482121625,171,1,0,0,0,1,1,2.5000000000000001E-3,null,1,0.99971328508176638,5.2200609294716983E-7,2.8619281214070343E-4,1,0,0,null,null,null,null,0.20257654874905273,5.0644137187263181E-4,null,null,null,null,null,null,null,null,1,1,1,1,1,1,1,1,null,1,5.0644137187263181E-4,null,null,null,{"$f":"CB$149*(H$16+($BW267*MMULT($AD267:$AH267,CC$3:CC$7)))","v":-3.0081130161549687},-0.30802470716638863,-1.8461037246692593,0,-0.11691005482121625,4.9384779173840349E-2,0.73489716055833565,0.157851000663078,0,0.88966521066119397,1.8317981510564478,2.6959727601733194E-2,0.40118894111477321,8.6172704439100467E-2,0,0.48567862684439322,3.0959905987768113,46.071577887334094,9.8958671525107107,0,55.774171198985144]
[null,null,null,null,null,null,null,null,null,null,null,null,null,null,null,null,null,null,null,null,null,null,null,null,null,null,null,null,173,-1.5093020901560095,1.5093020901560095,3.3248293892751218E-2,-3.3248293892751218E-2,-1.4804186264827487E-2,-0.11686229146461435,173,1,0,0,0,1,1,2.5000000000000001E-3,null,1,0.99956904985355077,1.1807304187603402E-6,4.2976931603050129E-4,1,0,0,null,null,null,null,0.20257654874905273,5.0644137187263181E-4,null,null,null,null,null,null,null,null,1,1,1,1,1,1,1,1,null,1,5.0644137187263181E-4,null,null,null,{"$f":"CB$149*(H$16+($BW268*MMULT($AD268:$AH268,CC$3:CC$7)))","v":-3.0081648242666819},-0.30797289905467529,-1.8461584528839454,0,-0.11686229146461435,4.9382220707959196E-2,0.73493523517880621,0.15784236199601687,0,0.88970770507273678,1.831867522955519,2.6957310006941088E-2,0.4011945328847078,8.616472535162116E-2,0,0.48568343175672996,3.0957129679765831,46.072220032811366,9.8949508531998376,0,55.774722983618958]
[null,null,null,null,null,null,null,null,null,null,null,null,null,null,null,null,null,null,null,null,null,null,null,null,null,null,null,null,175,-1.5091762356373934,1.5091762356373934,3.3176242848857798E-2,-3.3176242848857798E-2,-1.4804186264827487E-2,-0.11695562181158664,175,1,0,0,0,1,1,2.5000000000000001E-3,null,1,0.99885705715435213,1.9505101565816555E-5,1.1234376440820836E-3,1,0,0,null,null,null,null,0.20257654874905273,5.0644137187263181E-4,null,null,null,null,null,null,null,null,1,1,1,1,1,1,1,1,null,1,5.0644137187263181E-4,null,null,null,{"$f":"CB$149*(H$16+($BW269*MMULT($AD269:$AH269,CC$3:CC$7)))","v":-3.0079669187041724},-0.30817080461718471,-1.8461046494092228,0,-0.11695562181158664,4.9391994691257303E-2,0.73478980179919229,0.1578508546920169,0,0.88962467221872132,1.8316573234011879,2.6965739748492777E-2,0.4011611737695388,8.6179250166131011E-2,0,0.48569383631583735,3.0966810193226384,46.068389151859137,9.8966188481379085,0,55.775917818287063]
[null,null,null,null,null,null,null,null,null,null,null,null,null,null,null,null,null,null,null,null,null,null,null,null,null,null,null,null,177,-1.5093476725034227,1.5093476725034227,3.3255154932580112E-2,-3.3255154932580112E-2,-1.4804186264827487E-2,-0.11682351634290747,177,1,0,0,0,1,1,2.5000000000000001E-3,null,1,0.99983559417431733,7.1442990138948797E-8,1.6433428269247344E-4,1,0,0,null,null,null,null,0.20257654874905273,5.0644137187263181E-4,null,null,null,null,null,null,null,null,1,1,1,1,1,1,1,1,null,1,5.0644137187263181E-4,null,null,null,{"$f":"CB$149*(H$16+($BW270*MMULT($AD270:$AH270,CC$3:CC$7)))","v":-3.0082172676539241},-0.30792045566743309,-1.8461971741915297,0,-0.11682351634290747,4.937963100494272E-2,0.73497377868260971,0.15783625025169631,0,0.88974220426613548,1.8319318642053841,2.6954949564328666E-2,0.40120148191287169,8.6158362838543195E-2,0,0.48568520568425655,3.0954419003958948,46.073018042575555,9.8942201974244917,0,55.774926697210816]
[null,null,null,null,null,null,null,null,null,null,null,null,null,null,null,null,null,null,null,null,null,null,null,null,null,null,null,null,180,-1.4693008535270107,1.4693008535270107,2.9604932898829754E-2,-2.9604932898829754E-2,-1.4804186264827487E-2,-0.15150443304894159,180,1,0,0,0,1,1,2.5000000000000001E-3,null,1,0.9742127788919841,6.1171531341751902E-4,2.5175505694598393E-2,1,0,0,null,null,null,null,0.20257654874905273,5.0644137187263181E-4,null,null,null,null,null,null,null,null,1,1,1,1,1,1,1,1,null,1,5.0644137187263181E-4,null,null,null,{"$f":"CB$149*(H$16+($BW271*MMULT($AD271:$AH271,CC$3:CC$7)))","v":-2.9645202266437618},-0.35161749667759556,-1.8098005772488681,0,-0.15150443304894159,5.1585212519600437E-2,0.70354918041417058,0.16368677641533189,0,0.85941407243983814,1.7782352417889411,2.9009217288768079E-2,0.39564460532588797,9.2050125072687033E-2,0,0.48329605231265688,3.3313490896742532,45.43487963383442,10.570816072449762,0,55.500562041648315]
[null,null,null,null,null,null,null,null,null,null,null,null,null,null,null,null,null,null,null,null,null,null,null,null,null,null,null,null,181,-1.4674169099980654,1.4674169099980654,3.08239458233373E-2,-3.08239458233373E-2,-1.4804186264827487E-2,-0.15349547333168506,181,1,0,0,0,1,1,2.5000000000000001E-3,null,1,0.98281666603121731,2.7279110194892628E-4,1.6910542766833719E-2,1,0,0,null,null,null,null,0.20257654874905273,5.0644137187263181E-4,null,null,null,null,null,null,null,null,1,1,1,1,1,1,1,1,null,1,5.0644137187263181E-4,null,null,null,{"$f":"CB$149*(H$16+($BW272*MMULT($AD272:$AH272,CC$3:CC$7)))","v":-2.9638552960393239},-0.35228242728203329,-1.8066976207954153,0,-0.15349547333168506,5.1619524512424013E-2,0.70308152452897188,0.1641954781861133,0,0.85770464673448832,1.7766011739619976,2.905521242975841E-2,0.39574527746203725,9.2421124444008462E-2,0,0.48277838566419584,3.3366310615917412,45.44644058102503,10.613420752390571,0,55.441114442599407]
[null,null,null,null,null,null,null,null,null,null,null,null,null,null,null,null,null,null,null,null,null,null,null,null,null,null,null,null,182,-1.505670344112638,1.505670344112638,3.3137518855250458E-2,-3.3137518855250458E-2,-1.4804186264827487E-2,-0.12006435672128964,182,1,0,0,0,1,1,2.5000000000000001E-3,null,1,0.99951302705629619,9.9607343007298856E-8,4.8687323636078779E-4,1,0,0,null,null,null,null,0.20257654874905273,5.0644137187263181E-4,null,null,null,null,null,null,null,null,1,1,1,1,1,1,1,1,null,1,5.0644137187263181E-4,null,null,null,{"$f":"CB$149*(H$16+($BW273*MMULT($AD273:$AH273,CC$3:CC$7)))","v":-3.0044223031858097},-0.31171542013554743,-1.8426374818780746,0,-0.12006435672128964,4.9567380976964059E-2,0.73218986507522743,0.15839909992999715,0,0.88686335926248427,1.8270197052446728,2.7130184110590115E-2,0.40075641383253346,8.6698079651409396E-2,0,0.48541532240546709,3.1155654163238333,46.021907489349708,9.9561999845840674,0,55.743933947349149]
[null,null,null,null,null,null,null,null,null,null,null,null,null,null,null,null,null,null,null,null,null,null,null,null,null,null,null,null,183,-1.5028782737748367,1.5028782737748367,3.1543321794596478E-2,-3.1543321794596478E-2,-1.4804186264827487E-2,-0.12213597973289045,183,1,0,0,0,1,1,2.5000000000000001E-3,null,1,0.9909135034820854,4.4612792661760257E-4,8.6403684912970298E-3,1,0,0,null,null,null,null,0.20257654874905273,5.0644137187263181E-4,null,null,null,null,null,null,null,null,1,1,1,1,1,1,1,1,null,1,5.0644137187263181E-4,null,null,null,{"$f":"CB$149*(H$16+($BW274*MMULT($AD274:$AH274,CC$3:CC$7)))","v":-3.0000360357873541},-0.31610168753400281,-1.8414396086009275,0,-0.12213597973289045,4.9785274283981058E-2,0.72898531767923369,0.15858895566778286,0,0.88502801444695134,1.8223875620779491,2.731870833623018E-2,0.40001662261567433,8.7022628428693988E-2,0,0.48564204061940147,3.1372150872272515,45.936951636446125,9.9934703894695005,0,55.769969724463877]
[null,null,null,null,null,null,null,null,null,null,null,null,null,null,null,null,null,null,null,null,null,null,null,null,null,null,null,null,184,-1.503391803121048,1.503391803121048,3.2369714151826219E-2,-3.2369714151826219E-2,-1.4804186264827487E-2,-0.12189279434404633,184,1,0,0,0,1,1,2.5000000000000001E-3,null,1,0.99403109218907382,1.9782710213219417E-4,5.7710806087940139E-3,1,0,0,null,null,null,null,0.20257654874905273,5.0644137187263181E-4,null,null,null,null,null,null,null,null,1,1,1,1,1,1,1,1,null,1,5.0644137187263181E-4,null,null,null,{"$f":"CB$149*(H$16+($BW275*MMULT($AD275:$AH275,CC$3:CC$7)))","v":-3.0013759574907954},-0.3147617658305617,-1.841126745589909,0,-0.12189279434404633,4.9718610586497666E-2,0.72996275562680157,0.15863858004837914,0,0.88524326650079888,1.8235632127624772,2.7264539138832481E-2,0.40029473643581376,8.6993737830486778E-2,0,0.48544698659486701,3.1309944262337859,45.968889561979395,9.990152662311278,0,55.747570187082296]
[null,null,null,null,null,null,null,null,null,null,null,null,null,null,null,null,null,null,null,null,null,null,null,null,null,null,null,null,186,-1.5092488219928097,1.5092488219928097,3.3249753944237487E-2,-3.3249753944237487E-2,-1.4804186264827487E-2,-0.11691005482121626,186,1,0,0,0,1,1,2.5000000000000001E-3,null,1,0.99971328508176638,5.2200609294717036E-7,2.8619281214070316E-4,1,0,0,null,null,null,null,0.20257654874905273,5.0644137187263181E-4,null,null,null,null,null,null,null,null,1,1,1,1,1,1,1,1,null,1,5.0644137187263181E-4,null,null,null,{"$f":"CB$149*(H$16+($BW276*MMULT($AD276:$AH276,CC$3:CC$7)))","v":-3.0081130161549687},-0.30802470716638863,-1.8461037246692593,0,-0.11691005482121626,4.9384779173840349E-2,0.73489716055833565,0.157851000663078,0,0.88966521066119386,1.8317981510564478,2.6959727601733194E-2,0.40118894111477321,8.6172704439100467E-2,0,0.48567862684439317,3.0959905987768113,46.071577887334094,9.8958671525107107,0,55.774171198985144]
[null,null,null,null,null,null,null,null,null,null,null,null,null,null,null,null,null,null,null,null,null,null,null,null,null,null,null,null,187,-1.4813165003843303,1.4813165003843303,1.3683449865402824E-2,-1.3683449865402824E-2,-1.4804186264827487E-2,-0.13669966894074162,187,1,0,0,0,1,1,2.5000000000000001E-3,null,1,0.97063593374838597,7.224153254861628E-3,2.2139912896752392E-2,1,0,0,null,null,null,null,0.20257654874905273,5.0644137187263181E-4,null,null,null,null,null,null,null,null,1,1,1,1,1,1,1,1,null,1,5.0644137187263181E-4,null,null,null,{"$f":"CB$149*(H$16+($BW277*MMULT($AD277:$AH277,CC$3:CC$7)))","v":-2.9606143904676543},-0.35552333285370286,-1.8377377071396146,0,-0.13669966894074162,5.1787089902157739E-2,0.70080659211058605,0.15917712435408504,0,0.87223214520301273,1.7840029515698417,2.9028589810676853E-2,0.39282815731549547,8.9224697870604081E-2,0,0.48891855500322351,3.3335737837286659,45.111445484538407,10.246350774268681,0,56.146236795070998]
[null,null,null,null,null,null,null,null,null,null,null,null,null,null,null,null,null,null,null,null,null,null,null,null,null,null,null,null,191,-1.5049220896817643,1.5049220896817643,3.2994571276601131E-2,-3.2994571276601131E-2,-1.4804186264827487E-2,-0.12069302914779335,191,1,0,0,0,1,1,2.5000000000000001E-3,null,1,0.99665072786794773,2.7143117664745505E-5,3.3221289143874964E-3,1,0,0,null,null,null,null,0.20257654874905273,5.0644137187263181E-4,null,null,null,null,null,null,null,null,1,1,1,1,1,1,1,1,null,1,5.0644137187263181E-4,null,null,null,{"$f":"CB$149*(H$16+($BW278*MMULT($AD278:$AH278,CC$3:CC$7)))","v":-3.0035311011762866},-0.31260662214507051,-1.8420321750258504,0,-0.12069302914779335,4.9611575216570024E-2,0.73153762667737487,0.15849500901485566,0,0.88630598794278692,1.8259501988515874,2.7170278383152353E-2,0.40063394233723787,8.6801386540848416E-2,0,0.48539439273876145,3.1201697466327754,46.007843155924142,9.968063500537081,0,55.741530434512775]
[null,null,null,null,null,null,null,null,null,null,null,null,null,null,null,null,null,null,null,null,null,null,null,null,null,null,null,null,192,-1.5091643924271529,1.5091643924271529,3.3215627901639337E-2,-3.3215627901639337E-2,-1.4804186264827487E-2,-0.1169763389088197,192,1,0,0,0,1,1,2.5000000000000001E-3,null,1,0.99924307161957437,8.6253787917431345E-6,7.4830290163390703E-4,1,0,0,null,null,null,null,0.20257654874905273,5.0644137187263181E-4,null,null,null,null,null,null,null,null,1,1,1,1,1,1,1,1,null,1,5.0644137187263181E-4,null,null,null,{"$f":"CB$149*(H$16+($BW279*MMULT($AD279:$AH279,CC$3:CC$7)))","v":-3.0079944605467137},-0.30814326277464366,-1.8460534211462007,0,-0.1169763389088197,4.9390634363449766E-2,0.73481003954290525,0.1578589413242496,0,0.88960624196879734,1.831665857199402,2.6964871441654499E-2,0.40117035356351627,8.6183263559661633E-2,0,0.48568151143516758,3.0965813050433297,46.069443337430776,9.8970797366462637,0,55.774502458486388]
[null,null,null,null,null,null,null,null,null,null,null,null,null,null,null,null,null,null,null,null,null,null,null,null,null,null,null,null,193,-1.2287408887022464,1.2287408887022464,-1.3307324896814387E-2,1.3307324896814387E-2,-1.4804186264827487E-2,-0.35440649121608253,193,1,0,0,0,1,1,2.5000000000000001E-3,null,1,0.82316697154540452,1.191687151034896E-2,0.16491615684424657,1,0,0,null,null,null,null,0.20257654874905273,5.0644137187263181E-4,null,null,null,null,null,null,null,null,1,1,1,1,1,1,1,1,null,1,5.0644137187263181E-4,null,null,null,{"$f":"CB$149*(H$16+($BW280*MMULT($AD280:$AH280,CC$3:CC$7)))","v":-2.6810480040233533},-0.63508971929800384,-1.6121528702197478,0,-0.35440649121608253,6.8491337331603105E-2,0.52988794501037728,0.19945774487583606,0,0.70158971932571279,1.4994267465435291,4.567834840180688E-2,0.35339368610828925,0.13302266705300878,0,0.46790529843689516,5.245592214757921,40.582885184196336,15.276004739523287,0,53.73312469912922]
[null,null,null,null,null,null,null,null,null,null,null,null,null,null,null,null,null,null,null,null,null,null,null,null,null,null,null,null,194,-1.5028782737748367,1.5028782737748367,3.1543321794596471E-2,-3.1543321794596471E-2,-1.4804186264827487E-2,-0.12213597973289046,194,1,0,0,0,1,1,2.5000000000000001E-3,null,1,0.9909135034820854,4.4612792661760333E-4,8.6403684912970298E-3,1,0,0,null,null,null,null,0.20257654874905273,5.0644137187263181E-4,null,null,null,null,null,null,null,null,1,1,1,1,1,1,1,1,null,1,5.0644137187263181E-4,null,null,null,{"$f":"CB$149*(H$16+($BW281*MMULT($AD281:$AH281,CC$3:CC$7)))","v":-3.0000360357873541},-0.31610168753400281,-1.8414396086009275,0,-0.12213597973289046,4.9785274283981058E-2,0.72898531767923369,0.15858895566778286,0,0.88502801444695134,1.8223875620779491,2.731870833623018E-2,0.40001662261567433,8.7022628428693988E-2,0,0.48564204061940147,3.1372150872272515,45.936951636446125,9.9934703894695005,0,55.769969724463877]
[null,null,null,null,null,null,null,null,null,null,null,null,null,null,null,null,null,null,null,null,null,null,null,null,null,null,null,null,195,-1.5092488219928097,1.5092488219928097,3.3249753944237487E-2,-3.3249753944237487E-2,-1.4804186264827487E-2,-0.11691005482121626,195,1,0,0,0,1,1,2.5000000000000001E-3,null,1,0.99971328508176638,5.2200609294716983E-7,2.8619281214070289E-4,{"$f":"IF($AS282= 1,1,0)","v":1},{"$f":"IF($AS282= 2,1,0)","v":0},{"$f":"IF($AS282= 3,1,0)","v":0},null,null,null,null,0.20257654874905273,{"$f":"AQ282*BD282","v":5.0644137187263181E-4},null,null,null,null,null,null,null,null,{"$f":"INDEX(AK$148:AK$149,2-AK282)","v":1},{"$f":"INDEX(AL$148:AL$149,2-AL282)","v":1},{"$f":"INDEX(AM$148:AM$149,2-AM282)","v":1},{"$f":"INDEX(AN$148:AN$149,2-AN282)","v":1},{"$f":"INDEX(AO$148:AO$149,2-AO282)","v":1},{"$f":"INDEX(AW$148:AW$149,2-AW282)","v":1},{"$f":"INDEX(AX$148:AX$149,2-AX282)","v":1},{"$f":"INDEX(AY$148:AY$149,2-AY282)","v":1},null,1,5.0644137187263181E-4,null,null,null,{"$f":"CB$149*(H$16+($BW282*MMULT($AD282:$AH282,CC$3:CC$7)))","v":-3.0081130161549687},-0.30802470716638863,-1.8461037246692593,0,-0.11691005482121626,{"$f":"$BW282*IF(CB$149=0,0,IF(ABS(CB282)>OverflowTrigger,OverflowTrigger,EXP(CB282)))","v":4.9384779173840349E-2},{"$f":"$BW282*IF(CC$149=0,0,IF(ABS(CC282)>OverflowTrigger,OverflowTrigger,EXP(CC282)))","v":0.73489716055833565},{"$f":"$BW282*IF(CD$149=0,0,IF(ABS(CD282)>OverflowTrigger,OverflowTrigger,EXP(CD282)))","v":0.157851000663078},{"$f":"$BW282*IF(CE$149=0,0,IF(ABS(CE282)>OverflowTrigger,OverflowTrigger,EXP(CE282)))","v":0},{"$f":"IF(L$12=\"\",0,$BW282*IF($CG$149=0,0,IF(ABS(CF282)>OverflowTrigger,OverflowTrigger,EXP(CF282))))","v":0.88966521066119386},1.8317981510564478,2.6959727601733194E-2,{"$f":"IF($CL282=0,0,CH282/$CL282)","v":0.40118894111477321},{"$f":"IF($CL282=0,0,CI282/$CL282)","v":8.6172704439100467E-2},{"$f":"IF($CL282=0,0,CJ282/$CL282)","v":0},{"$f":"IF($CL282=0,0,CK282/$CL282)","v":0.48567862684439317},{"$f":"CM282*$BX282*TargetMarketSize","v":3.0959905987768113},{"$f":"CN282*$BX282*TargetMarketSize","v":46.071577887334094},{"$f":"CO282*$BX282*TargetMarketSize","v":9.8958671525107107},{"$f":"CP282*$BX282*TargetMarketSize","v":0},{"$f":"CQ282*$BX282*TargetMarketSize","v":55.774171198985144}]
[null,null,null,null,null,null,null,null,null,null,null,null,null,null,null,null,null,null,null,null,null,null,null,null,null,null,null,null,197,-1.5091202624756672,1.5091202624756672,3.3232590330286055E-2,-3.3232590330286055E-2,-1.4804186264827487E-2,-0.11701998078655712,197,1,0,0,0,1,1,{"$f":"AP283/$AP$554","v":2.5000000000000001E-3},null,1,0.99949781972128804,3.8137396250310849E-6,4.9836643908689052E-4,1,0,0,null,null,null,null,0.20257654874905273,5.0644137187263181E-4,null,null,null,null,null,null,null,null,1,1,1,1,1,1,1,1,null,{"$f":"IF(AND(BN283:BU283),1,0)","v":1},{"$f":"BE283*BW283","v":5.0644137187263181E-4},null,null,null,{"$f":"CB$149*(H$16+($BW283*MMULT($AD283:$AH283,CC$3:CC$7)))","v":-3.0079672930238743},-0.30817043029748259,-1.8459923287660682,0,{"$f":"IF($CG$149=0,0,$L$16+$AI283)","v":-0.11701998078655712},4.9391976202864028E-2,0.73479007684554343,0.15786858559729311,0,0.88956741872911649,{"$f":"IF($CG$149=0,0,SUM(CG283:CK283))","v":1.8316180573748171},{"$f":"IF($CL283=0,0,CG283/$CL283)","v":2.6966307743032148E-2},0.40116992398441836,8.6190778127378617E-2,0,0.48567299014517085,3.0967462464562363,46.069394005595228,9.897942691619301,0,55.773523893935987]
[null,null,null,null,null,null,null,null,null,null,null,null,null,null,null,null,null,null,null,null,null,null,null,null,null,null,null,null,198,-1.5049220896817641,1.5049220896817641,3.2994571276601131E-2,-3.2994571276601131E-2,-1.4804186264827487E-2,-0.12069302914779334,198,1,0,0,0,1,1,2.5000000000000001E-3,null,1,0.99665072786794773,2.7143117664745407E-5,3.3221289143874786E-3,1,0,0,null,null,null,null,0.20257654874905273,5.0644137187263181E-4,null,null,null,null,null,null,null,null,1,1,1,1,1,1,1,1,null,1,5.0644137187263181E-4,null,null,null,{"$f":"CB$149*(H$16+($BW284*MMULT($AD284:$AH284,CC$3:CC$7)))","v":-3.0035311011762866},-0.31260662214507073,-1.8420321750258501,0,-0.12069302914779334,4.9611575216570024E-2,0.73153762667737476,0.15849500901485572,0,0.88630598794278692,1.8259501988515874,2.7170278383152353E-2,0.40063394233723781,8.6801386540848444E-2,0,0.48539439273876145,3.1201697466327754,46.007843155924135,9.9680635005370846,0,55.741530434512775]
[null,null,null,null,null,null,null,null,null,null,null,null,null,null,null,null,null,null,null,null,null,null,null,null,null,null,null,null,199,-1.5088406939880887,1.5088406939880887,3.3040957816924163E-2,-3.3040957816924163E-2,-1.4804186264827487E-2,-0.11721913707383816,199,1,0,0,0,1,1,2.5000000000000001E-3,null,1,0.9986344519879865,6.2991602224493778E-5,1.302556309788999E-3,1,0,0,null,null,null,null,0.20257654874905273,5.0644137187263181E-4,null,null,null,null,null,null,null,null,1,1,1,1,1,1,1,1,null,1,5.0644137187263181E-4,null,null,null,{"$f":"CB$149*(H$16+($BW285*MMULT($AD285:$AH285,CC$3:CC$7)))","v":-3.0074960920229339},-0.30864163129842304,-1.8459043927918517,0,-0.11721913707383816,4.9415255235610293E-2,0.73444392458590302,0.1578824685355617,0,0.88939027342510235,1.8311319217821773,2.6986179776450042E-2,0.40108739072774952,8.6221241985613012E-2,0,0.48570518751018749,3.0990283032169446,46.059916083914857,9.9014410881939785,0,55.777221362280976]
[null,null,null,null,null,null,null,null,null,null,null,null,null,null,null,null,null,null,null,null,null,null,null,null,null,null,null,null,200,-1.5091202624756672,1.5091202624756672,3.3232590330286055E-2,-3.3232590330286055E-2,-1.4804186264827487E-2,-0.11701998078655712,200,1,0,0,0,1,1,2.5000000000000001E-3,null,1,0.99949781972128804,3.8137396250310883E-6,4.9836643908689182E-4,1,0,0,null,null,null,null,{"$f":"$BC$222/$BB$222","v":0.20257654874905273},5.0644137187263181E-4,null,null,null,null,null,null,null,null,1,1,1,1,1,1,1,1,null,1,5.0644137187263181E-4,null,null,null,{"$f":"CB$149*(H$16+($BW286*MMULT($AD286:$AH286,CC$3:CC$7)))","v":-3.0079672930238743},-0.30817043029748259,-1.8459923287660682,0,-0.11701998078655712,4.9391976202864028E-2,0.73479007684554343,0.15786858559729311,0,0.88956741872911649,1.8316180573748171,2.6966307743032148E-2,0.40116992398441836,8.6190778127378617E-2,0,0.48567299014517085,3.0967462464562363,46.069394005595228,9.897942691619301,0,55.773523893935987]
[null,null,null,null,null,null,null,null,null,null,null,null,null,null,null,null,null,null,null,null,null,null,null,null,null,null,null,null,201,-1.4742869935442529,1.4742869935442529,3.1947498681818738E-2,-3.1947498681818738E-2,-1.4804186264827487E-2,-0.14767449126710006,201,1,0,0,0,1,1,2.5000000000000001E-3,null,1,0.99018065714958092,3.7609975171225995E-5,9.7817327752479002E-3,1,0,0,null,null,null,null,0.20257654874905273,5.0644137187263181E-4,null,null,null,null,null,null,null,null,1,1,1,1,1,1,1,1,null,1,5.0644137187263181E-4,null,null,null,{"$f":"CB$149*(H$16+($BW287*MMULT($AD287:$AH287,CC$3:CC$7)))","v":-2.9718489324439927},-0.34428879087736441,-1.8124441514831213,0,-0.14767449126710006,5.1208541614438059E-2,0.70872422540194158,0.16325462972830682,0,0.8627118894962893,1.7858992862409759,2.8673812688633529E-2,0.39684445302270621,9.1413122221427695E-2,0,0.48306861206723245,3.292832028072477,45.572667271906639,10.497664189462407,0,55.474443348165217]
[null,null,null,null,null,null,null,null,null,null,null,null,null,null,null,null,null,null,null,null,null,null,null,null,null,null,null,null,203,-1.5045454864530086,1.5045454864530086,3.3047041413162115E-2,-3.3047041413162115E-2,-1.4804186264827487E-2,-0.12104160954793187,203,1,0,0,0,1,1,2.5000000000000001E-3,null,1,0.99777353675263414,1.2011877085744581E-5,2.2144512702800701E-3,1,0,0,null,null,null,null,0.20257654874905273,5.0644137187263181E-4,null,null,null,null,null,null,null,null,1,1,1,1,1,1,1,1,null,1,5.0644137187263181E-4,null,null,null,{"$f":"CB$149*(H$16+($BW288*MMULT($AD288:$AH288,CC$3:CC$7)))","v":-3.0032069680840916},-0.31293075523726532,-1.8416031016605336,0,-0.12104160954793187,4.9627658576287384E-2,0.73130054954873014,0.15856302959362534,0,0.88599709288737338,1.8254883306060163,2.718596319912505E-2,0.40060543652226838,8.6860609807889816E-2,0,0.48534799047071669,3.1219709533627684,46.004569616352086,9.9748645587932199,0,55.736201709098673]
[null,null,null,null,null,null,null,null,null,null,null,null,null,null,null,null,null,null,null,null,null,null,null,null,null,null,null,null,205,-1.5091643924271529,1.5091643924271529,3.3215627901639337E-2,-3.3215627901639337E-2,-1.4804186264827487E-2,-0.1169763389088197,205,1,0,0,0,1,1,2.5000000000000001E-3,null,1,0.99924307161957437,8.6253787917431345E-6,7.4830290163390703E-4,1,0,0,null,null,null,null,0.20257654874905273,5.0644137187263181E-4,null,null,null,null,null,null,null,null,1,1,1,1,1,1,1,1,null,1,5.0644137187263181E-4,null,null,null,{"$f":"CB$149*(H$16+($BW289*MMULT($AD289:$AH289,CC$3:CC$7)))","v":-3.0079944605467137},-0.30814326277464366,-1.8460534211462007,0,-0.1169763389088197,4.9390634363449766E-2,0.73481003954290525,0.1578589413242496,0,0.88960624196879734,1.831665857199402,2.6964871441654499E-2,0.40117035356351627,8.6183263559661633E-2,0,0.48568151143516758,3.0965813050433297,46.069443337430776,9.8970797366462637,0,55.774502458486388]
[null,null,null,null,null,null,null,null,null,null,null,null,null,null,null,null,null,null,null,null,null,null,null,null,null,null,null,null,207,-1.5092488219928097,1.5092488219928097,3.3249753944237487E-2,-3.3249753944237487E-2,-1.4804186264827487E-2,-0.11691005482121626,207,1,0,0,0,1,1,2.5000000000000001E-3,null,1,0.99971328508176638,5.2200609294717078E-7,2.8619281214070289E-4,1,0,0,null,null,null,null,0.20257654874905273,5.0644137187263181E-4,null,null,null,null,null,null,null,null,1,1,1,1,1,1,1,1,null,1,5.0644137187263181E-4,null,null,null,{"$f":"CB$149*(H$16+($BW290*MMULT($AD290:$AH290,CC$3:CC$7)))","v":-3.0081130161549687},-0.30802470716638863,-1.8461037246692593,0,-0.11691005482121626,4.9384779173840349E-2,0.73489716055833565,0.157851000663078,0,0.88966521066119386,1.8317981510564478,2.6959727601733194E-2,0.40118894111477321,8.6172704439100467E-2,0,0.48567862684439317,3.0959905987768113,46.071577887334094,9.8958671525107107,0,55.774171198985144]
[null,null,null,null,null,null,null,null,null,null,null,null,null,null,null,null,null,null,null,null,null,null,null,null,null,null,null,null,211,-1.5093476725034227,1.5093476725034227,3.3255154932580112E-2,-3.3255154932580112E-2,-1.4804186264827487E-2,-0.11682351634290747,211,1,0,0,0,1,1,2.5000000000000001E-3,null,1,0.99983559417431733,7.1442990138948797E-8,1.6433428269247314E-4,1,0,0,null,null,null,null,0.20257654874905273,5.0644137187263181E-4,null,null,null,null,null,null,null,null,1,1,1,1,1,1,1,1,null,1,5.0644137187263181E-4,null,null,null,{"$f":"CB$149*(H$16+($BW291*MMULT($AD291:$AH291,CC$3:CC$7)))","v":-3.0082172676539241},-0.30792045566743309,-1.8461971741915297,0,-0.11682351634290747,4.937963100494272E-2,0.73497377868260971,0.15783625025169631,0,0.88974220426613548,1.8319318642053841,2.6954949564328666E-2,0.40120148191287169,8.6158362838543195E-2,0,0.48568520568425655,3.0954419003958948,46.073018042575555,9.8942201974244917,0,55.774926697210816]
[null,null,null,null,null,null,null,null,null,null,null,null,null,null,null,null,null,null,null,null,null,null,null,null,null,null,null,null,213,-1.5088406939880887,1.5088406939880887,3.3040957816924163E-2,-3.3040957816924163E-2,-1.4804186264827487E-2,-0.11721913707383816,213,1,0,0,0,1,1,2.5000000000000001E-3,null,1,0.9986344519879865,6.2991602224493832E-5,1.3025563097890001E-3,1,0,0,null,null,null,null,0.20257654874905273,5.0644137187263181E-4,null,null,null,null,null,null,null,null,1,1,1,1,1,1,1,1,null,1,5.0644137187263181E-4,null,null,null,{"$f":"CB$149*(H$16+($BW292*MMULT($AD292:$AH292,CC$3:CC$7)))","v":-3.0074960920229339},-0.30864163129842304,-1.8459043927918517,0,-0.11721913707383816,4.9415255235610293E-2,0.73444392458590302,0.1578824685355617,0,0.88939027342510235,1.8311319217821773,2.6986179776450042E-2,0.40108739072774952,8.6221241985613012E-2,0,0.48570518751018749,3.0990283032169446,46.059916083914857,9.9014410881939785,0,55.777221362280976]
[null,null,null,null,null,null,null,null,null,null,null,null,null,null,null,null,null,null,null,null,null,null,null,null,null,null,null,null,215,-1.5093476725034227,1.5093476725034227,3.3255154932580112E-2,-3.3255154932580112E-2,-1.4804186264827487E-2,-0.11682351634290747,215,1,0,0,0,1,1,2.5000000000000001E-3,null,1,0.99983559417431744,7.1442990138948744E-8,1.643342826924727E-4,1,0,0,null,null,null,null,0.20257654874905273,5.0644137187263181E-4,null,null,null,null,null,null,null,null,1,1,1,1,1,1,1,1,null,1,5.0644137187263181E-4,null,null,null,{"$f":"CB$149*(H$16+($BW293*MMULT($AD293:$AH293,CC$3:CC$7)))","v":-3.0082172676539241},-0.30792045566743309,-1.8461971741915297,0,-0.11682351634290747,4.937963100494272E-2,0.73497377868260971,0.15783625025169631,0,0.88974220426613548,1.8319318642053841,2.6954949564328666E-2,0.40120148191287169,8.6158362838543195E-2,0,0.48568520568425655,3.0954419003958948,46.073018042575555,9.8942201974244917,0,55.774926697210816]
[null,null,null,null,null,null,null,null,null,null,null,null,null,null,null,null,null,null,null,null,null,null,null,null,null,null,null,null,217,-1.503391803121048,1.503391803121048,3.2369714151826219E-2,-3.2369714151826219E-2,-1.4804186264827487E-2,-0.12189279434404633,217,1,0,0,0,1,1,2.5000000000000001E-3,null,1,0.99403109218907382,1.9782710213219382E-4,5.7710806087940139E-3,1,0,0,null,null,null,null,0.20257654874905273,5.0644137187263181E-4,null,null,null,null,null,null,null,null,1,1,1,1,1,1,1,1,null,1,5.0644137187263181E-4,null,null,null,{"$f":"CB$149*(H$16+($BW294*MMULT($AD294:$AH294,CC$3:CC$7)))","v":-3.0013759574907954},-0.3147617658305617,-1.841126745589909,0,-0.12189279434404633,4.9718610586497666E-2,0.72996275562680157,0.15863858004837914,0,0.88524326650079888,1.8235632127624772,2.7264539138832481E-2,0.40029473643581376,8.6993737830486778E-2,0,0.48544698659486701,3.1309944262337859,45.968889561979395,9.990152662311278,0,55.747570187082296]
[null,null,null,null,null,null,null,null,null,null,null,null,null,null,null,null,null,null,null,null,null,null,null,null,null,null,null,null,219,-1.5093476725034227,1.5093476725034227,3.3255154932580112E-2,-3.3255154932580112E-2,-1.4804186264827487E-2,-0.11682351634290747,219,1,0,0,0,1,1,2.5000000000000001E-3,null,1,0.99983559417431733,7.1442990138948797E-8,1.6433428269247314E-4,1,0,0,null,null,null,null,0.20257654874905273,5.0644137187263181E-4,null,null,null,null,null,null,null,null,1,1,1,1,1,1,1,1,null,1,5.0644137187263181E-4,null,null,null,{"$f":"CB$149*(H$16+($BW295*MMULT($AD295:$AH295,CC$3:CC$7)))","v":-3.0082172676539241},-0.30792045566743309,-1.8461971741915297,0,-0.11682351634290747,4.937963100494272E-2,0.73497377868260971,0.15783625025169631,0,0.88974220426613548,1.8319318642053841,2.6954949564328666E-2,0.40120148191287169,8.6158362838543195E-2,0,0.48568520568425655,3.0954419003958948,46.073018042575555,9.8942201974244917,0,55.774926697210816]
[null,null,null,null,null,null,null,null,null,null,null,null,null,null,null,null,null,null,null,null,null,null,null,null,null,null,null,null,221,-1.5053688534167771,1.5053688534167771,3.3119130180877331E-2,-3.3119130180877331E-2,-1.4804186264827487E-2,-0.12032780085946229,221,1,0,0,0,1,1,2.5000000000000001E-3,null,1,0.99872574051568852,1.6453415387905984E-6,1.2726140427727372E-3,1,0,0,null,null,null,null,0.20257654874905273,5.0644137187263181E-4,null,null,null,null,null,null,null,null,1,1,1,1,1,1,1,1,null,1,5.0644137187263181E-4,null,null,null,{"$f":"CB$149*(H$16+($BW296*MMULT($AD296:$AH296,CC$3:CC$7)))","v":-3.0041024238155756},-0.31203529950578157,-1.8423543798565869,0,-0.12032780085946229,4.9583239095782432E-2,0.73195569009816419,0.15844394938357512,0,0.8866297510818304,1.8266126296593521,2.7144912003060708E-2,0.40071752390908838,8.6741954375473454E-2,0,0.4853956097123775,3.1172567322489182,46.017441463611171,9.961238452896243,0,55.741670188850421]
[null,null,null,null,null,null,null,null,null,null,null,null,null,null,null,null,null,null,null,null,null,null,null,null,null,null,null,null,222,-1.5086258715490799,1.5086258715490799,3.2803023640439112E-2,-3.2803023640439112E-2,-1.4804186264827487E-2,-0.11734872727796372,222,1,0,0,0,1,1,2.5000000000000001E-3,null,1,0.99790273408958319,1.4239743472403476E-4,1.9548683756927779E-3,1,0,0,null,null,null,null,0.20257654874905273,5.0644137187263181E-4,null,null,null,null,null,null,null,null,1,1,1,1,1,1,1,1,null,1,5.0644137187263181E-4,null,null,null,{"$f":"CB$149*(H$16+($BW297*MMULT($AD297:$AH297,CC$3:CC$7)))","v":-3.00704333540744},-0.30909438791391697,-1.845927504529328,0,-0.11734872727796372,4.9437633384869825E-2,0.73411147550527678,0.15787881963956313,0,0.88927502462574082,1.8307029531554506,2.7004726954560129E-2,0.40099977674692761,8.6239452100865838E-2,0,0.4857560441976464,3.1011582167646976,46.049854704031752,9.9035322942498496,0,55.783061622560446]
[null,null,null,null,null,null,null,null,null,null,null,null,null,null,null,null,null,null,null,null,null,null,null,null,null,null,null,null,225,-1.5049479946737441,1.5049479946737441,3.3110826502676577E-2,-3.3110826502676577E-2,-1.4804186264827487E-2,-0.12070003870611336,225,1,0,0,0,1,1,2.5000000000000001E-3,null,1,0.99915157166837576,7.2761786220126458E-7,8.4770061376205263E-4,1,0,0,null,null,null,null,0.20257654874905273,5.0644137187263181E-4,null,null,null,null,null,null,null,null,1,1,1,1,1,1,1,1,null,1,5.0644137187263181E-4,null,null,null,{"$f":"CB$149*(H$16+($BW298*MMULT($AD298:$AH298,CC$3:CC$7)))","v":-3.0036732613943418},-0.31246446192701538,-1.8419418247917547,0,-0.12070003870611336,4.9604522925508675E-2,0.73164162961826418,0.15850932972295309,0,0.88629977535104887,1.8260552576177749,2.7164853154674776E-2,0.40066784757255658,8.6804235009700817E-2,0,0.4853630642630678,3.1195467263778633,46.011736752007401,9.9683906118832422,0,55.737932747338235]
[null,null,null,null,null,null,null,null,null,null,null,null,null,null,null,null,null,null,null,null,null,null,null,null,null,null,null,null,226,-1.5053688534167771,1.5053688534167771,3.3119130180877331E-2,-3.3119130180877331E-2,-1.4804186264827487E-2,-0.12032780085946231,226,1,0,0,0,1,1,2.5000000000000001E-3,null,1,0.99872574051568852,1.6453415387905954E-6,1.2726140427727372E-3,1,0,0,null,null,null,null,0.20257654874905273,5.0644137187263181E-4,null,null,null,null,null,null,null,null,1,1,1,1,1,1,1,1,null,1,5.0644137187263181E-4,null,null,null,{"$f":"CB$149*(H$16+($BW299*MMULT($AD299:$AH299,CC$3:CC$7)))","v":-3.0041024238155756},-0.31203529950578157,-1.8423543798565869,0,-0.12032780085946231,4.9583239095782432E-2,0.73195569009816419,0.15844394938357512,0,0.8866297510818304,1.8266126296593521,2.7144912003060708E-2,0.40071752390908838,8.6741954375473454E-2,0,0.4853956097123775,3.1172567322489182,46.017441463611171,9.961238452896243,0,55.741670188850421]
[null,null,null,null,null,null,null,null,null,null,null,null,null,null,null,null,null,null,null,null,null,null,null,null,null,null,null,null,228,-1.5028782737748367,1.5028782737748367,3.1543321794596471E-2,-3.1543321794596471E-2,-1.4804186264827487E-2,-0.12213597973289046,228,1,0,0,0,1,1,2.5000000000000001E-3,null,1,0.9909135034820854,4.4612792661760263E-4,8.6403684912970142E-3,1,0,0,null,null,null,null,0.20257654874905273,5.0644137187263181E-4,null,null,null,null,null,null,null,null,1,1,1,1,1,1,1,1,null,1,5.0644137187263181E-4,null,null,null,{"$f":"CB$149*(H$16+($BW300*MMULT($AD300:$AH300,CC$3:CC$7)))","v":-3.0000360357873541},-0.31610168753400281,-1.8414396086009275,0,-0.12213597973289046,4.9785274283981058E-2,0.72898531767923369,0.15858895566778286,0,0.88502801444695134,1.8223875620779491,2.731870833623018E-2,0.40001662261567433,8.7022628428693988E-2,0,0.48564204061940147,3.1372150872272515,45.936951636446125,9.9934703894695005,0,55.769969724463877]
[null,null,null,null,null,null,null,null,null,null,null,null,null,null,null,null,null,null,null,null,null,null,null,null,null,null,null,null,230,-1.5033213373061378,1.5033213373061378,3.2741895882471408E-2,-3.2741895882471408E-2,-1.4804186264827487E-2,-0.12205169406295729,230,1,0,0,0,1,1,2.5000000000000001E-3,null,1,0.99606198831151072,8.7626273848360293E-5,3.8503853146409526E-3,1,0,0,null,null,null,null,0.20257654874905273,5.0644137187263181E-4,null,null,null,null,null,null,null,null,1,1,1,1,1,1,1,1,null,1,5.0644137187263181E-4,null,null,null,{"$f":"CB$149*(H$16+($BW301*MMULT($AD301:$AH301,CC$3:CC$7)))","v":-3.0016776734065305},-0.31446004991482668,-1.8406840980443535,0,-0.12205169406295729,4.9703611953152461E-2,0.73018303023657483,0.15870881657033317,0,0.88510261276979918,1.8236980715298596,2.7254298685229848E-2,0.4003859200355685,8.7025818060549834E-2,0,0.48533396321865185,3.1298184370491278,45.979360868358071,9.9938366791585196,0,55.734590853041034]
[null,null,null,null,null,null,null,null,null,null,null,null,null,null,null,null,null,null,null,null,null,null,null,null,null,null,null,null,235,-1.5091202624756672,1.5091202624756672,3.3232590330286055E-2,-3.3232590330286055E-2,-1.4804186264827487E-2,-0.11701998078655712,235,1,0,0,0,1,1,2.5000000000000001E-3,null,1,0.99949781972128804,3.8137396250310917E-6,4.9836643908689226E-4,1,0,0,null,null,null,null,0.20257654874905273,5.0644137187263181E-4,null,null,null,null,null,null,null,null,1,1,1,1,1,1,1,1,null,1,5.0644137187263181E-4,null,null,null,{"$f":"CB$149*(H$16+($BW302*MMULT($AD302:$AH302,CC$3:CC$7)))","v":-3.0079672930238743},-0.30817043029748259,-1.8459923287660682,0,-0.11701998078655712,4.9391976202864028E-2,0.73479007684554343,0.15786858559729311,0,0.88956741872911649,1.8316180573748171,2.6966307743032148E-2,0.40116992398441836,8.6190778127378617E-2,0,0.48567299014517085,3.0967462464562363,46.069394005595228,9.897942691619301,0,55.773523893935987]
[null,null,null,null,null,null,null,null,null,null,null,null,null,null,null,null,null,null,null,null,null,null,null,null,null,null,null,null,236,-1.5092488219928097,1.5092488219928097,3.3249753944237487E-2,-3.3249753944237487E-2,-1.4804186264827487E-2,-0.11691005482121625,236,1,0,0,0,1,1,2.5000000000000001E-3,null,1,0.99971328508176638,5.2200609294716898E-7,2.8619281214070343E-4,1,0,0,null,null,null,null,0.20257654874905273,5.0644137187263181E-4,null,null,null,null,null,null,null,null,1,1,1,1,1,1,1,1,null,1,5.0644137187263181E-4,null,null,null,{"$f":"CB$149*(H$16+($BW303*MMULT($AD303:$AH303,CC$3:CC$7)))","v":-3.0081130161549687},-0.30802470716638863,-1.8461037246692593,0,-0.11691005482121625,4.9384779173840349E-2,0.73489716055833565,0.157851000663078,0,0.88966521066119397,1.8317981510564478,2.6959727601733194E-2,0.40118894111477321,8.6172704439100467E-2,0,0.48567862684439322,3.0959905987768113,46.071577887334094,9.8958671525107107,0,55.774171198985144]
[null,null,null,null,null,null,null,null,null,null,null,null,null,null,null,null,null,null,null,null,null,null,null,null,null,null,null,null,242,-1.5090575615491655,1.5090575615491655,3.3239076549465452E-2,-3.3239076549465452E-2,-1.4804186264827487E-2,-0.11707743462177173,242,1,0,0,0,1,1,2.5000000000000001E-3,null,1,0.99966643255060272,1.6861121372075302E-6,3.3188123726009131E-4,1,0,0,null,null,null,null,0.20257654874905273,5.0644137187263181E-4,null,null,null,null,null,null,null,null,1,1,1,1,1,1,1,1,null,1,5.0644137187263181E-4,null,null,null,{"$f":"CB$149*(H$16+($BW304*MMULT($AD304:$AH304,CC$3:CC$7)))","v":-3.0079110783165524},-0.30822664500480501,-1.8459231416203872,0,-0.11707743462177173,4.939475283639342E-2,0.73474877199741107,0.15787950845197951,0,0.88951631113740626,1.8315393444231902,2.6968982668482831E-2,0.40116461283489746,8.6200446052498408E-2,0,0.4856659584441213,3.0970534284934619,46.068784085894684,9.8990529330031443,0,55.772716390215457]
[null,null,null,null,null,null,null,null,null,null,null,null,null,null,null,null,null,null,null,null,null,null,null,null,null,null,null,null,244,-1.5091202624756672,1.5091202624756672,3.3232590330286055E-2,-3.3232590330286055E-2,-1.4804186264827487E-2,-0.11701998078655712,244,1,0,0,0,1,1,2.5000000000000001E-3,null,1,0.99949781972128804,3.8137396250310781E-6,4.9836643908689226E-4,1,0,0,null,null,null,null,0.20257654874905273,5.0644137187263181E-4,null,null,null,null,null,null,null,null,1,1,1,1,1,1,1,1,null,1,5.0644137187263181E-4,null,null,null,{"$f":"CB$149*(H$16+($BW305*MMULT($AD305:$AH305,CC$3:CC$7)))","v":-3.0079672930238743},-0.30817043029748259,-1.8459923287660682,0,-0.11701998078655712,4.9391976202864028E-2,0.73479007684554343,0.15786858559729311,0,0.88956741872911649,1.8316180573748171,2.6966307743032148E-2,0.40116992398441836,8.6190778127378617E-2,0,0.48567299014517085,3.0967462464562363,46.069394005595228,9.897942691619301,0,55.773523893935987]
[null,null,null,null,null,null,null,null,null,null,null,null,null,null,null,null,null,null,null,null,null,null,null,null,null,null,null,null,246,-1.48131650038433,1.48131650038433,1.3683449865402788E-2,-1.3683449865402788E-2,-1.4804186264827487E-2,-0.13669966894074168,246,1,0,0,0,1,1,2.5000000000000001E-3,null,1,0.97063593374838597,7.224153254861628E-3,2.2139912896752392E-2,1,0,0,null,null,null,null,0.20257654874905273,5.0644137187263181E-4,null,null,null,null,null,null,null,null,1,1,1,1,1,1,1,1,null,1,5.0644137187263181E-4,null,null,null,{"$f":"CB$149*(H$16+($BW306*MMULT($AD306:$AH306,CC$3:CC$7)))","v":-2.9606143904676543},-0.35552333285370308,-1.8377377071396144,0,-0.13669966894074168,5.1787089902157739E-2,0.70080659211058594,0.15917712435408507,0,0.87223214520301273,1.7840029515698415,2.9028589810676856E-2,0.39282815731549547,8.9224697870604108E-2,0,0.48891855500322356,3.3335737837286663,45.111445484538407,10.246350774268684,0,56.146236795070998]
[null,null,null,null,null,null,null,null,null,null,null,null,null,null,null,null,null,null,null,null,null,null,null,null,null,null,null,null,248,-1.5045454864530086,1.5045454864530086,3.3047041413162115E-2,-3.3047041413162115E-2,-1.4804186264827487E-2,-0.12104160954793187,248,1,0,0,0,1,1,2.5000000000000001E-3,null,1,0.99777353675263414,1.2011877085744601E-5,2.2144512702800701E-3,1,0,0,null,null,null,null,0.20257654874905273,5.0644137187263181E-4,null,null,null,null,null,null,null,null,1,1,1,1,1,1,1,1,null,1,5.0644137187263181E-4,null,null,null,{"$f":"CB$149*(H$16+($BW307*MMULT($AD307:$AH307,CC$3:CC$7)))","v":-3.0032069680840916},-0.31293075523726532,-1.8416031016605336,0,-0.12104160954793187,4.9627658576287384E-2,0.73130054954873014,0.15856302959362534,0,0.88599709288737338,1.8254883306060163,2.718596319912505E-2,0.40060543652226838,8.6860609807889816E-2,0,0.48534799047071669,3.1219709533627684,46.004569616352086,9.9748645587932199,0,55.736201709098673]
[null,null,null,null,null,null,null,null,null,null,null,null,null,null,null,null,null,null,null,null,null,null,null,null,null,null,null,null,249,-1.5088406939880887,1.5088406939880887,3.3040957816924163E-2,-3.3040957816924163E-2,-1.4804186264827487E-2,-0.11721913707383816,249,1,0,0,0,1,1,2.5000000000000001E-3,null,1,0.9986344519879865,6.2991602224493886E-5,1.3025563097890009E-3,1,0,0,null,null,null,null,0.20257654874905273,5.0644137187263181E-4,null,null,null,null,null,null,null,null,1,1,1,1,1,1,1,1,null,1,5.0644137187263181E-4,null,null,null,{"$f":"CB$149*(H$16+($BW308*MMULT($AD308:$AH308,CC$3:CC$7)))","v":-3.0074960920229339},-0.30864163129842304,-1.8459043927918517,0,-0.11721913707383816,4.9415255235610293E-2,0.73444392458590302,0.1578824685355617,0,0.88939027342510235,1.8311319217821773,2.6986179776450042E-2,0.40108739072774952,8.6221241985613012E-2,0,0.48570518751018749,3.0990283032169446,46.059916083914857,9.9014410881939785,0,55.777221362280976]
[null,null,null,null,null,null,null,null,null,null,null,null,null,null,null,null,null,null,null,null,null,null,null,null,null,null,null,null,250,-1.5092488219928097,1.5092488219928097,3.3249753944237487E-2,-3.3249753944237487E-2,-1.4804186264827487E-2,-0.11691005482121625,250,1,0,0,0,1,1,2.5000000000000001E-3,null,1,0.99971328508176638,5.2200609294716941E-7,2.8619281214070262E-4,1,0,0,null,null,null,null,0.20257654874905273,5.0644137187263181E-4,null,null,null,null,null,null,null,null,1,1,1,1,1,1,1,1,null,1,5.0644137187263181E-4,null,null,null,{"$f":"CB$149*(H$16+($BW309*MMULT($AD309:$AH309,CC$3:CC$7)))","v":-3.0081130161549687},-0.30802470716638863,-1.8461037246692593,0,-0.11691005482121625,4.9384779173840349E-2,0.73489716055833565,0.157851000663078,0,0.88966521066119397,1.8317981510564478,2.6959727601733194E-2,0.40118894111477321,8.6172704439100467E-2,0,0.48567862684439322,3.0959905987768113,46.071577887334094,9.8958671525107107,0,55.774171198985144]
[null,null,null,null,null,null,null,null,null,null,null,null,null,null,null,null,null,null,null,null,null,null,null,null,null,null,null,null,251,-1.5053688534167771,1.5053688534167771,3.3119130180877331E-2,-3.3119130180877331E-2,-1.4804186264827487E-2,-0.12032780085946229,251,1,0,0,0,1,1,2.5000000000000001E-3,null,1,0.99872574051568852,1.6453415387906013E-6,1.2726140427727372E-3,1,0,0,null,null,null,null,0.20257654874905273,5.0644137187263181E-4,null,null,null,null,null,null,null,null,1,1,1,1,1,1,1,1,null,1,5.0644137187263181E-4,null,null,null,{"$f":"CB$149*(H$16+($BW310*MMULT($AD310:$AH310,CC$3:CC$7)))","v":-3.0041024238155756},-0.31203529950578157,-1.8423543798565869,0,-0.12032780085946229,4.9583239095782432E-2,0.73195569009816419,0.15844394938357512,0,0.8866297510818304,1.8266126296593521,2.7144912003060708E-2,0.40071752390908838,8.6741954375473454E-2,0,0.4853956097123775,3.1172567322489182,46.017441463611171,9.961238452896243,0,55.741670188850421]
[null,null,null,null,null,null,null,null,null,null,null,null,null,null,null,null,null,null,null,null,null,null,null,null,null,null,null,null,253,-1.5049479946737441,1.5049479946737441,3.3110826502676577E-2,-3.3110826502676577E-2,-1.4804186264827487E-2,-0.12070003870611336,253,1,0,0,0,1,1,2.5000000000000001E-3,null,1,0.99915157166837576,7.2761786220126712E-7,8.4770061376205263E-4,1,0,0,null,null,null,null,0.20257654874905273,5.0644137187263181E-4,null,null,null,null,null,null,null,null,1,1,1,1,1,1,1,1,null,1,5.0644137187263181E-4,null,null,null,{"$f":"CB$149*(H$16+($BW311*MMULT($AD311:$AH311,CC$3:CC$7)))","v":-3.0036732613943418},-0.31246446192701538,-1.8419418247917547,0,-0.12070003870611336,4.9604522925508675E-2,0.73164162961826418,0.15850932972295309,0,0.88629977535104887,1.8260552576177749,2.7164853154674776E-2,0.40066784757255658,8.6804235009700817E-2,0,0.4853630642630678,3.1195467263778633,46.011736752007401,9.9683906118832422,0,55.737932747338235]
[null,null,null,null,null,null,null,null,null,null,null,null,null,null,null,null,null,null,null,null,null,null,null,null,null,null,null,null,254,-1.5053688534167771,1.5053688534167771,3.3119130180877331E-2,-3.3119130180877331E-2,-1.4804186264827487E-2,-0.12032780085946231,254,1,0,0,0,1,1,2.5000000000000001E-3,null,1,0.99872574051568852,1.6453415387905927E-6,1.2726140427727372E-3,1,0,0,null,null,null,null,0.20257654874905273,5.0644137187263181E-4,null,null,null,null,null,null,null,null,1,1,1,1,1,1,1,1,null,1,5.0644137187263181E-4,null,null,null,{"$f":"CB$149*(H$16+($BW312*MMULT($AD312:$AH312,CC$3:CC$7)))","v":-3.0041024238155756},-0.31203529950578157,-1.8423543798565869,0,-0.12032780085946231,4.9583239095782432E-2,0.73195569009816419,0.15844394938357512,0,0.8866297510818304,1.8266126296593521,2.7144912003060708E-2,0.40071752390908838,8.6741954375473454E-2,0,0.4853956097123775,3.1172567322489182,46.017441463611171,9.961238452896243,0,55.741670188850421]
[null,null,null,null,null,null,null,null,null,null,null,null,null,null,null,null,null,null,null,null,null,null,null,null,null,null,null,null,259,-1.5093476725034227,1.5093476725034227,3.3255154932580112E-2,-3.3255154932580112E-2,-1.4804186264827487E-2,-0.11682351634290747,259,1,0,0,0,1,1,2.5000000000000001E-3,null,1,0.99983559417431733,7.1442990138948611E-8,1.64334282692473E-4,1,0,0,null,null,null,null,0.20257654874905273,5.0644137187263181E-4,null,null,null,null,null,null,null,null,1,1,1,1,1,1,1,1,null,1,5.0644137187263181E-4,null,null,null,{"$f":"CB$149*(H$16+($BW313*MMULT($AD313:$AH313,CC$3:CC$7)))","v":-3.0082172676539241},-0.30792045566743309,-1.8461971741915297,0,-0.11682351634290747,4.937963100494272E-2,0.73497377868260971,0.15783625025169631,0,0.88974220426613548,1.8319318642053841,2.6954949564328666E-2,0.40120148191287169,8.6158362838543195E-2,0,0.48568520568425655,3.0954419003958948,46.073018042575555,9.8942201974244917,0,55.774926697210816]
[null,null,null,null,null,null,null,null,null,null,null,null,null,null,null,null,null,null,null,null,null,null,null,null,null,null,null,null,260,-1.5033213373061378,1.5033213373061378,3.2741895882471408E-2,-3.2741895882471408E-2,-1.4804186264827487E-2,-0.12205169406295731,260,1,0,0,0,1,1,2.5000000000000001E-3,null,1,0.99606198831151072,8.7626273848360144E-5,3.8503853146409596E-3,1,0,0,null,null,null,null,0.20257654874905273,5.0644137187263181E-4,null,null,null,null,null,null,null,null,1,1,1,1,1,1,1,1,null,1,5.0644137187263181E-4,null,null,null,{"$f":"CB$149*(H$16+($BW314*MMULT($AD314:$AH314,CC$3:CC$7)))","v":-3.0016776734065305},-0.31446004991482668,-1.8406840980443535,0,-0.12205169406295731,4.9703611953152461E-2,0.73018303023657483,0.15870881657033317,0,0.88510261276979918,1.8236980715298596,2.7254298685229848E-2,0.4003859200355685,8.7025818060549834E-2,0,0.48533396321865185,3.1298184370491278,45.979360868358071,9.9938366791585196,0,55.734590853041034]
[null,null,null,null,null,null,null,null,null,null,null,null,null,null,null,null,null,null,null,null,null,null,null,null,null,null,null,null,266,-1.5094302725134356,1.5094302725134356,3.3258177168558216E-2,-3.3258177168558216E-2,-1.4804186264827487E-2,-0.11675081892024039,266,1,0,0,0,1,1,2.5000000000000001E-3,null,1,0.99990563295063783,9.7773455681443678E-9,9.4357172016646171E-5,1,0,0,null,null,null,null,0.20257654874905273,5.0644137187263181E-4,null,null,null,null,null,null,null,null,1,1,1,1,1,1,1,1,null,1,5.0644137187263181E-4,null,null,null,{"$f":"CB$149*(H$16+($BW315*MMULT($AD315:$AH315,CC$3:CC$7)))","v":-3.0083028898999151},-0.30783483342144202,-1.8462767519655645,0,-0.11675081892024039,4.9375403191029912E-2,0.73503671148247052,0.1578236904939847,0,0.88980688858238677,1.8320426937498719,2.695101121795752E-2,0.40121156236702027,8.6146295079481544E-2,0,0.48569113133554065,3.0949896301237345,46.074175657805817,9.8928343648539592,0,55.775607184823251]
[null,null,null,null,null,null,null,null,null,null,null,null,null,null,null,null,null,null,null,null,null,null,null,null,null,null,null,null,269,-1.5093845873581657,1.5093845873581657,3.3256762514902408E-2,-3.3256762514902408E-2,-1.4804186264827487E-2,-0.1167910934795952,269,1,0,0,0,1,1,2.5000000000000001E-3,null,1,0.9999371681519843,4.3221199834884873E-9,6.2827425895749115E-5,1,0,0,null,null,null,null,0.20257654874905273,5.0644137187263181E-4,null,null,null,null,null,null,null,null,1,1,1,1,1,1,1,1,null,1,5.0644137187263181E-4,null,null,null,{"$f":"CB$149*(H$16+($BW316*MMULT($AD316:$AH316,CC$3:CC$7)))","v":-3.0082557900909892},-0.30788193323036772,-1.8462324814639504,0,-0.1167910934795952,4.9377728817853711E-2,0.73500209220909329,0.15783067758258928,0,0.88977105272367985,1.8319815513332163,2.695318016817325E-2,0.40120605563642214,8.6152984165003582E-2,0,0.48568778003040097,3.0952387071758594,46.073543278042429,9.8936025234272424,0,55.77522232896122]
[null,null,null,null,null,null,null,null,null,null,null,null,null,null,null,null,null,null,null,null,null,null,null,null,null,null,null,null,271,-1.5093476725034227,1.5093476725034227,3.3255154932580112E-2,-3.3255154932580112E-2,-1.4804186264827487E-2,-0.11682351634290747,271,1,0,0,0,1,1,2.5000000000000001E-3,null,1,0.99983559417431733,7.1442990138948797E-8,1.6433428269247344E-4,1,0,0,null,null,null,null,0.20257654874905273,5.0644137187263181E-4,null,null,null,null,null,null,null,null,1,1,1,1,1,1,1,1,null,1,5.0644137187263181E-4,null,null,null,{"$f":"CB$149*(H$16+($BW317*MMULT($AD317:$AH317,CC$3:CC$7)))","v":-3.0082172676539241},-0.30792045566743309,-1.8461971741915297,0,-0.11682351634290747,4.937963100494272E-2,0.73497377868260971,0.15783625025169631,0,0.88974220426613548,1.8319318642053841,2.6954949564328666E-2,0.40120148191287169,8.6158362838543195E-2,0,0.48568520568425655,3.0954419003958948,46.073018042575555,9.8942201974244917,0,55.774926697210816]
[null,null,null,null,null,null,null,null,null,null,null,null,null,null,null,null,null,null,null,null,null,null,null,null,null,null,null,null,276,-1.5045454864530086,1.5045454864530086,3.3047041413162115E-2,-3.3047041413162115E-2,-1.4804186264827487E-2,-0.12104160954793189,276,1,0,0,0,1,1,2.5000000000000001E-3,null,1,0.99777353675263414,1.2011877085744581E-5,2.214451270280074E-3,1,0,0,null,null,null,null,{"$f":"$BC$222/$BB$222","v":0.20257654874905273},5.0644137187263181E-4,null,null,null,null,null,null,null,null,1,1,1,1,1,1,1,1,null,1,5.0644137187263181E-4,null,null,null,{"$f":"CB$149*(H$16+($BW318*MMULT($AD318:$AH318,CC$3:CC$7)))","v":-3.0032069680840916},-0.31293075523726532,-1.8416031016605336,0,-0.12104160954793189,4.9627658576287384E-2,0.73130054954873014,0.15856302959362534,0,0.88599709288737338,1.8254883306060163,2.718596319912505E-2,0.40060543652226838,8.6860609807889816E-2,0,0.48534799047071669,3.1219709533627684,46.004569616352086,9.9748645587932199,0,55.736201709098673]
[null,null,null,null,null,null,null,null,null,null,null,null,null,null,null,null,null,null,null,null,null,null,null,null,null,null,null,null,277,-1.5092488219928097,1.5092488219928097,3.3249753944237487E-2,-3.3249753944237487E-2,-1.4804186264827487E-2,-0.11691005482121626,277,1,0,0,0,1,1,2.5000000000000001E-3,null,1,0.99971328508176638,5.2200609294716898E-7,2.8619281214070343E-4,1,0,0,null,null,null,null,0.20257654874905273,5.0644137187263181E-4,null,null,null,null,null,null,null,null,1,1,1,1,1,1,1,1,null,1,5.0644137187263181E-4,null,null,null,{"$f":"CB$149*(H$16+($BW319*MMULT($AD319:$AH319,CC$3:CC$7)))","v":-3.0081130161549687},-0.30802470716638863,-1.8461037246692593,0,-0.11691005482121626,4.9384779173840349E-2,0.73489716055833565,0.157851000663078,0,0.88966521066119386,1.8317981510564478,2.6959727601733194E-2,0.40118894111477321,8.6172704439100467E-2,0,0.48567862684439317,3.0959905987768113,46.071577887334094,9.8958671525107107,0,55.774171198985144]
[null,null,null,null,null,null,null,null,null,null,null,null,null,null,null,null,null,null,null,null,null,null,null,null,null,null,null,null,284,-1.5093752395456375,1.5093752395456375,3.3228983712371596E-2,-3.3228983712371596E-2,-1.4804186264827487E-2,-0.11679222775087439,284,1,0,0,0,1,1,2.5000000000000001E-3,null,1,0.99902506339652841,6.0393475244860308E-6,9.6889715594707755E-4,1,0,0,null,null,null,null,0.20257654874905273,5.0644137187263181E-4,null,null,null,null,null,null,null,null,1,1,1,1,1,1,1,1,null,1,5.0644137187263181E-4,null,null,null,{"$f":"CB$149*(H$16+($BW320*MMULT($AD320:$AH320,CC$3:CC$7)))","v":-3.0082186634759305},-0.30791905984542689,-1.846250912453953,0,-0.11679222775087439,4.9379562079815198E-2,0.73497480457590003,0.15782776863375614,0,0.88977004348250199,1.8319521787719735,2.6954613036305444E-2,0.40119759297897245,8.6152777601189362E-2,0,0.48569501638353263,3.0954032543230743,46.072571446713418,9.8935788021331579,0,55.776053334437094]
[null,null,null,null,null,null,null,null,null,null,null,null,null,null,null,null,null,null,null,null,null,null,null,null,null,null,null,null,286,-1.5093476725034227,1.5093476725034227,3.3255154932580112E-2,-3.3255154932580112E-2,-1.4804186264827487E-2,-0.11682351634290747,286,1,0,0,0,1,1,2.5000000000000001E-3,null,1,0.99983559417431733,7.1442990138948611E-8,1.64334282692473E-4,1,0,0,null,null,null,null,0.20257654874905273,5.0644137187263181E-4,null,null,null,null,null,null,null,null,1,1,1,1,1,1,1,1,null,1,5.0644137187263181E-4,null,null,null,{"$f":"CB$149*(H$16+($BW321*MMULT($AD321:$AH321,CC$3:CC$7)))","v":-3.0082172676539241},-0.30792045566743309,-1.8461971741915297,0,-0.11682351634290747,4.937963100494272E-2,0.73497377868260971,0.15783625025169631,0,0.88974220426613548,1.8319318642053841,2.6954949564328666E-2,0.40120148191287169,8.6158362838543195E-2,0,0.48568520568425655,3.0954419003958948,46.073018042575555,9.8942201974244917,0,55.774926697210816]
[null,null,null,null,null,null,null,null,null,null,null,null,null,null,null,null,null,null,null,null,null,null,null,null,null,null,null,null,287,-1.5091202624756672,1.5091202624756672,3.3232590330286055E-2,-3.3232590330286055E-2,-1.4804186264827487E-2,-0.11701998078655712,287,1,0,0,0,1,1,2.5000000000000001E-3,null,1,0.99949781972128804,3.8137396250310849E-6,4.9836643908689139E-4,1,0,0,null,null,null,null,0.20257654874905273,5.0644137187263181E-4,null,null,null,null,null,null,null,null,1,1,1,1,1,1,1,1,null,1,5.0644137187263181E-4,null,null,null,{"$f":"CB$149*(H$16+($BW322*MMULT($AD322:$AH322,CC$3:CC$7)))","v":-3.0079672930238743},-0.30817043029748259,-1.8459923287660682,0,-0.11701998078655712,4.9391976202864028E-2,0.73479007684554343,0.15786858559729311,0,0.88956741872911649,1.8316180573748171,2.6966307743032148E-2,0.40116992398441836,8.6190778127378617E-2,0,0.48567299014517085,3.0967462464562363,46.069394005595228,9.897942691619301,0,55.773523893935987]
[null,null,null,null,null,null,null,null,null,null,null,null,null,null,null,null,null,null,null,null,null,null,null,null,null,null,null,null,288,-1.505670344112638,1.505670344112638,3.3137518855250458E-2,-3.3137518855250458E-2,-1.4804186264827487E-2,-0.12006435672128964,288,1,0,0,0,1,1,2.5000000000000001E-3,null,1,0.99951302705629619,9.9607343007298856E-8,4.8687323636078779E-4,1,0,0,null,null,null,null,0.20257654874905273,5.0644137187263181E-4,null,null,null,null,null,null,null,null,1,1,1,1,1,1,1,1,null,1,5.0644137187263181E-4,null,null,null,{"$f":"CB$149*(H$16+($BW323*MMULT($AD323:$AH323,CC$3:CC$7)))","v":-3.0044223031858097},-0.31171542013554743,-1.8426374818780746,0,-0.12006435672128964,4.9567380976964059E-2,0.73218986507522743,0.15839909992999715,0,0.88686335926248427,1.8270197052446728,2.7130184110590115E-2,0.40075641383253346,8.6698079651409396E-2,0,0.48541532240546709,3.1155654163238333,46.021907489349708,9.9561999845840674,0,55.743933947349149]
[null,null,null,null,null,null,null,null,null,null,null,null,null,null,null,null,null,null,null,null,null,null,null,null,null,null,null,null,290,-1.4693008535270107,1.4693008535270107,2.9604932898829751E-2,-2.9604932898829751E-2,-1.4804186264827487E-2,-0.15150443304894162,290,1,0,0,0,1,1,2.5000000000000001E-3,null,1,0.9742127788919841,6.1171531341751902E-4,2.5175505694598352E-2,1,0,0,null,null,null,null,0.20257654874905273,5.0644137187263181E-4,null,null,null,null,null,null,null,null,1,1,1,1,1,1,1,1,null,1,5.0644137187263181E-4,null,null,null,{"$f":"CB$149*(H$16+($BW324*MMULT($AD324:$AH324,CC$3:CC$7)))","v":-2.9645202266437618},-0.35161749667759556,-1.8098005772488681,0,-0.15150443304894162,5.1585212519600437E-2,0.70354918041417058,0.16368677641533189,0,0.85941407243983814,1.7782352417889411,2.9009217288768079E-2,0.39564460532588797,9.2050125072687033E-2,0,0.48329605231265688,3.3313490896742532,45.43487963383442,10.570816072449762,0,55.500562041648315]
[null,null,null,null,null,null,null,null,null,null,null,null,null,null,null,null,null,null,null,null,null,null,null,null,null,null,null,null,291,-1.5093020901560095,1.5093020901560095,3.3248293892751218E-2,-3.3248293892751218E-2,-1.4804186264827487E-2,-0.11686229146461435,291,1,0,0,0,1,1,2.5000000000000001E-3,null,1,0.99956904985355077,1.1807304187603431E-6,4.2976931603050167E-4,1,0,0,null,null,null,null,0.20257654874905273,5.0644137187263181E-4,null,null,null,null,null,null,null,null,1,1,1,1,1,1,1,1,null,1,5.0644137187263181E-4,null,null,null,{"$f":"CB$149*(H$16+($BW325*MMULT($AD325:$AH325,CC$3:CC$7)))","v":-3.0081648242666819},-0.30797289905467529,-1.8461584528839454,0,-0.11686229146461435,4.9382220707959196E-2,0.73493523517880621,0.15784236199601687,0,0.88970770507273678,1.831867522955519,2.6957310006941088E-2,0.4011945328847078,8.616472535162116E-2,0,0.48568343175672996,3.0957129679765831,46.072220032811366,9.8949508531998376,0,55.774722983618958]
[null,null,null,null,null,null,null,null,null,null,null,null,null,null,null,null,null,null,null,null,null,null,null,null,null,null,null,null,292,-1.4882000613062976,1.4882000613062976,2.1830812478214539E-2,-2.1830812478214539E-2,-1.4804186264827487E-2,-0.13268247091412724,292,1,0,0,0,1,1,2.5000000000000001E-3,null,1,0.98384074792860399,4.621797806577138E-3,1.1537454164818897E-2,1,0,0,null,null,null,null,0.20257654874905273,5.0644137187263181E-4,null,null,null,null,null,null,null,null,1,1,1,1,1,1,1,1,null,1,5.0644137187263181E-4,null,null,null,{"$f":"CB$149*(H$16+($BW326*MMULT($AD326:$AH326,CC$3:CC$7)))","v":-2.975645314002433},-0.34049240931892388,-1.8364739054487702,0,-0.13268247091412724,5.1014503006762892E-2,0.71141992669897147,0.15937841984498602,0,0.8757431218781152,1.7975559714288356,2.8379924640795827E-2,0.39577066750999707,8.8663953934240952E-2,0,0.48718545391496615,3.2590826279806193,45.449356313370231,10.18195628256804,0,55.94721161368787]
[null,null,null,null,null,null,null,null,null,null,null,null,null,null,null,null,null,null,null,null,null,null,null,null,null,null,null,null,294,-1.5092488219928097,1.5092488219928097,3.3249753944237487E-2,-3.3249753944237487E-2,-1.4804186264827487E-2,-0.11691005482121626,294,1,0,0,0,1,1,2.5000000000000001E-3,null,1,0.99971328508176638,5.2200609294717078E-7,2.8619281214070343E-4,1,0,0,null,null,null,null,0.20257654874905273,5.0644137187263181E-4,null,null,null,null,null,null,null,null,1,1,1,1,1,1,1,1,null,1,5.0644137187263181E-4,null,null,null,{"$f":"CB$149*(H$16+($BW327*MMULT($AD327:$AH327,CC$3:CC$7)))","v":-3.0081130161549687},-0.30802470716638863,-1.8461037246692593,0,-0.11691005482121626,4.9384779173840349E-2,0.73489716055833565,0.157851000663078,0,0.88966521066119386,1.8317981510564478,2.6959727601733194E-2,0.40118894111477321,8.6172704439100467E-2,0,0.48567862684439317,3.0959905987768113,46.071577887334094,9.8958671525107107,0,55.774171198985144]
[null,null,null,null,null,null,null,null,null,null,null,null,null,null,null,null,null,null,null,null,null,null,null,null,null,null,null,null,297,-1.5091202624756672,1.5091202624756672,3.3232590330286055E-2,-3.3232590330286055E-2,-1.4804186264827487E-2,-0.11701998078655712,297,1,0,0,0,1,1,2.5000000000000001E-3,null,1,0.99949781972128804,3.8137396250310985E-6,4.9836643908689139E-4,1,0,0,null,null,null,null,0.20257654874905273,5.0644137187263181E-4,null,null,null,null,null,null,null,null,1,1,1,1,1,1,1,1,null,1,5.0644137187263181E-4,null,null,null,{"$f":"CB$149*(H$16+($BW328*MMULT($AD328:$AH328,CC$3:CC$7)))","v":-3.0079672930238743},-0.30817043029748259,-1.8459923287660682,0,-0.11701998078655712,4.9391976202864028E-2,0.73479007684554343,0.15786858559729311,0,0.88956741872911649,1.8316180573748171,2.6966307743032148E-2,0.40116992398441836,8.6190778127378617E-2,0,0.48567299014517085,3.0967462464562363,46.069394005595228,9.897942691619301,0,55.773523893935987]
[null,null,null,null,null,null,null,null,null,null,null,null,null,null,null,null,null,null,null,null,null,null,null,null,null,null,null,null,302,-1.4693008535270107,1.4693008535270107,2.9604932898829761E-2,-2.9604932898829761E-2,-1.4804186264827487E-2,-0.15150443304894154,302,1,0,0,0,1,1,2.5000000000000001E-3,null,1,0.9742127788919841,6.1171531341752E-4,2.5175505694598393E-2,1,0,0,null,null,null,null,0.20257654874905273,5.0644137187263181E-4,null,null,null,null,null,null,null,null,1,1,1,1,1,1,1,1,null,1,5.0644137187263181E-4,null,null,null,{"$f":"CB$149*(H$16+($BW329*MMULT($AD329:$AH329,CC$3:CC$7)))","v":-2.9645202266437618},-0.35161749667759556,-1.8098005772488681,0,-0.15150443304894154,5.1585212519600437E-2,0.70354918041417058,0.16368677641533189,0,0.85941407243983825,1.7782352417889413,2.9009217288768076E-2,0.39564460532588791,9.205012507268702E-2,0,0.48329605231265688,3.3313490896742528,45.434879633834413,10.570816072449761,0,55.500562041648315]
[null,null,null,null,null,null,null,null,null,null,null,null,null,null,null,null,null,null,null,null,null,null,null,null,null,null,null,null,304,-1.5088406939880887,1.5088406939880887,3.3040957816924163E-2,-3.3040957816924163E-2,-1.4804186264827487E-2,-0.11721913707383816,304,1,0,0,0,1,1,2.5000000000000001E-3,null,1,0.9986344519879865,6.2991602224493669E-5,1.302556309788999E-3,1,0,0,null,null,null,null,0.20257654874905273,5.0644137187263181E-4,null,null,null,null,null,null,null,null,1,1,1,1,1,1,1,1,null,1,5.0644137187263181E-4,null,null,null,{"$f":"CB$149*(H$16+($BW330*MMULT($AD330:$AH330,CC$3:CC$7)))","v":-3.0074960920229339},-0.30864163129842304,-1.8459043927918517,0,-0.11721913707383816,4.9415255235610293E-2,0.73444392458590302,0.1578824685355617,0,0.88939027342510235,1.8311319217821773,2.6986179776450042E-2,0.40108739072774952,8.6221241985613012E-2,0,0.48570518751018749,3.0990283032169446,46.059916083914857,9.9014410881939785,0,55.777221362280976]
[null,null,null,null,null,null,null,null,null,null,null,null,null,null,null,null,null,null,null,null,null,null,null,null,null,null,null,null,309,-1.5045454864530086,1.5045454864530086,3.3047041413162115E-2,-3.3047041413162115E-2,-1.4804186264827487E-2,-0.12104160954793187,309,1,0,0,0,1,1,2.5000000000000001E-3,null,1,0.99777353675263414,1.2011877085744601E-5,2.2144512702800701E-3,1,0,0,null,null,null,null,0.20257654874905273,5.0644137187263181E-4,null,null,null,null,null,null,null,null,1,1,1,1,1,1,1,1,null,1,5.0644137187263181E-4,null,null,null,{"$f":"CB$149*(H$16+($BW331*MMULT($AD331:$AH331,CC$3:CC$7)))","v":-3.0032069680840916},-0.31293075523726532,-1.8416031016605336,0,-0.12104160954793187,4.9627658576287384E-2,0.73130054954873014,0.15856302959362534,0,0.88599709288737338,1.8254883306060163,2.718596319912505E-2,0.40060543652226838,8.6860609807889816E-2,0,0.48534799047071669,3.1219709533627684,46.004569616352086,9.9748645587932199,0,55.736201709098673]
[null,null,null,null,null,null,null,null,null,null,null,null,null,null,null,null,null,null,null,null,null,null,null,null,null,null,null,null,310,-4.0900659639675806E-3,4.0900659639675806E-3,-1.226481538629258,1.226481538629258,-1.4804186264827487E-2,-1.1301965722025045,310,1,0,0,0,1,1,2.5000000000000001E-3,null,2,2.0333996091354859E-3,0.94921671086345105,4.8749889427413505E-2,0,1,0,null,null,null,null,0.20257654874905273,5.0644137187263181E-4,null,null,null,null,null,null,null,null,1,1,1,1,1,1,1,1,null,1,5.0644137187263181E-4,null,null,null,{"$f":"CB$149*(H$16+($BW332*MMULT($AD332:$AH332,CC$3:CC$7)))","v":-0.24322296755263073},-3.0729147557687266,-1.6006762612139127,0,-1.1301965722025045,0.78409666616492868,4.6286045529521237E-2,0.20176002936649595,0,0.32296976330425131,1.3551125043651973,0.5786210839610243,3.4156607204509519E-2,0.14888802864453715,0,0.238334280189929,66.447460547865958,3.9224630290580307,17.097944896307691,0,27.369738364375074]
[null,null,null,null,null,null,null,null,null,null,null,null,null,null,null,null,null,null,null,null,null,null,null,null,null,null,null,null,339,-1.5582813744897112E-4,1.5582813744897112E-4,-1.2326130791455636,1.2326130791455636,-1.4804186264827487E-2,-1.1321112566172202,339,1,0,0,0,1,1,2.5000000000000001E-3,null,2,1.2662516508142527E-5,0.99588807714008754,4.0992602434042824E-3,0,1,0,null,null,null,null,0.20257654874905273,5.0644137187263181E-4,null,null,null,null,null,null,null,null,1,1,1,1,1,1,1,1,null,1,5.0644137187263181E-4,null,null,null,{"$f":"CB$149*(H$16+($BW333*MMULT($AD333:$AH333,CC$3:CC$7)))","v":-0.23315718920980655},-3.0829805341115506,-1.6028735639036997,0,-1.1321112566172202,0.79202906531597606,4.5822477455643502E-2,0.20131718821747627,0,0.32235196976059977,1.3615207007496957,0.58172385104380731,3.3655365967195518E-2,0.14786201054939874,0,0.23675877243959842,66.80377489422726,3.8649016849165698,16.980119433689914,0,27.188810824773007]
[null,null,null,null,null,null,null,null,null,null,null,null,null,null,null,null,null,null,null,null,null,null,null,null,null,null,null,null,341,-1.5091202624756672,1.5091202624756672,3.3232590330286055E-2,-3.3232590330286055E-2,-1.4804186264827487E-2,-0.11701998078655712,341,1,0,0,0,1,1,2.5000000000000001E-3,null,1,0.99949781972128804,3.8137396250310985E-6,4.9836643908689139E-4,1,0,0,null,null,null,null,0.20257654874905273,5.0644137187263181E-4,null,null,null,null,null,null,null,null,1,1,1,1,1,1,1,1,null,1,5.0644137187263181E-4,null,null,null,{"$f":"CB$149*(H$16+($BW334*MMULT($AD334:$AH334,CC$3:CC$7)))","v":-3.0079672930238743},-0.30817043029748259,-1.8459923287660682,0,-0.11701998078655712,4.9391976202864028E-2,0.73479007684554343,0.15786858559729311,0,0.88956741872911649,1.8316180573748171,2.6966307743032148E-2,0.40116992398441836,8.6190778127378617E-2,0,0.48567299014517085,3.0967462464562363,46.069394005595228,9.897942691619301,0,55.773523893935987]
[null,null,null,null,null,null,null,null,null,null,null,null,null,null,null,null,null,null,null,null,null,null,null,null,null,null,null,null,345,-1.5093476725034227,1.5093476725034227,3.3255154932580112E-2,-3.3255154932580112E-2,-1.4804186264827487E-2,-0.11682351634290747,345,1,0,0,0,1,1,2.5000000000000001E-3,null,1,0.99983559417431733,7.1442990138948545E-8,1.6433428269247314E-4,1,0,0,null,null,null,null,0.20257654874905273,5.0644137187263181E-4,null,null,null,null,null,null,null,null,1,1,1,1,1,1,1,1,null,1,5.0644137187263181E-4,null,null,null,{"$f":"CB$149*(H$16+($BW335*MMULT($AD335:$AH335,CC$3:CC$7)))","v":-3.0082172676539241},-0.30792045566743309,-1.8461971741915297,0,-0.11682351634290747,4.937963100494272E-2,0.73497377868260971,0.15783625025169631,0,0.88974220426613548,1.8319318642053841,2.6954949564328666E-2,0.40120148191287169,8.6158362838543195E-2,0,0.48568520568425655,3.0954419003958948,46.073018042575555,9.8942201974244917,0,55.774926697210816]
[null,null,null,null,null,null,null,null,null,null,null,null,null,null,null,null,null,null,null,null,null,null,null,null,null,null,null,null,367,-1.5093458573304643,1.5093458573304643,3.3242850821427042E-2,-3.3242850821427042E-2,-1.4804186264827487E-2,-0.11682195025137675,367,1,0,0,0,1,1,2.5000000000000001E-3,null,1,0.9993520014956494,2.6705104454116887E-6,6.4532789390516756E-4,1,0,0,null,null,null,null,0.20257654874905273,5.0644137187263181E-4,null,null,null,null,null,null,null,null,1,1,1,1,1,1,1,1,null,1,5.0644137187263181E-4,null,null,null,{"$f":"CB$149*(H$16+($BW336*MMULT($AD336:$AH336,CC$3:CC$7)))","v":-3.0082031483698124},-0.30793457495154453,-1.8462076631297244,0,-0.11682195025137675,4.9380328214904248E-2,0.73496340145227379,0.15783459472570491,0,0.88974359768495714,1.8319219220778402,2.6955476442410316E-2,0.4011979946277669,8.6157926723581371E-2,0,0.48568860220624133,3.0955024058138867,46.072617571099762,9.89417011502597,0,55.775316745667126]
[null,null,null,null,null,null,null,null,null,null,null,null,null,null,null,null,null,null,null,null,null,null,null,null,null,null,null,null,396,-1.5092488219928097,1.5092488219928097,3.3249753944237487E-2,-3.3249753944237487E-2,-1.4804186264827487E-2,-0.11691005482121625,396,1,0,0,0,1,1,2.5000000000000001E-3,null,1,0.99971328508176638,5.2200609294716941E-7,2.8619281214070262E-4,1,0,0,null,null,null,null,0.20257654874905273,5.0644137187263181E-4,null,null,null,null,null,null,null,null,1,1,1,1,1,1,1,1,null,1,5.0644137187263181E-4,null,null,null,{"$f":"CB$149*(H$16+($BW337*MMULT($AD337:$AH337,CC$3:CC$7)))","v":-3.0081130161549687},-0.30802470716638863,-1.8461037246692593,0,-0.11691005482121625,4.9384779173840349E-2,0.73489716055833565,0.157851000663078,0,0.88966521066119397,1.8317981510564478,2.6959727601733194E-2,0.40118894111477321,8.6172704439100467E-2,0,0.48567862684439322,3.0959905987768113,46.071577887334094,9.8958671525107107,0,55.774171198985144]
[null,null,null,null,null,null,null,null,null,null,null,null,null,null,null,null,null,null,null,null,null,null,null,null,null,null,null,null,397,-1.5092488219928097,1.5092488219928097,3.3249753944237487E-2,-3.3249753944237487E-2,-1.4804186264827487E-2,-0.11691005482121625,397,1,0,0,0,1,1,2.5000000000000001E-3,null,1,0.99971328508176638,5.2200609294716898E-7,2.8619281214070343E-4,1,0,0,null,null,null,null,0.20257654874905273,5.0644137187263181E-4,null,null,null,null,null,null,null,null,1,1,1,1,1,1,1,1,null,1,5.0644137187263181E-4,null,null,null,{"$f":"CB$149*(H$16+($BW338*MMULT($AD338:$AH338,CC$3:CC$7)))","v":-3.0081130161549687},-0.30802470716638863,-1.8461037246692593,0,-0.11691005482121625,4.9384779173840349E-2,0.73489716055833565,0.157851000663078,0,0.88966521066119397,1.8317981510564478,2.6959727601733194E-2,0.40118894111477321,8.6172704439100467E-2,0,0.48567862684439322,3.0959905987768113,46.071577887334094,9.8958671525107107,0,55.774171198985144]
[null,null,null,null,null,null,null,null,null,null,null,null,null,null,null,null,null,null,null,null,null,null,null,null,null,null,null,null,1,-0.47342686380814147,0.47342686380814147,5.7988402424965531E-5,-5.7988402424965531E-5,-1.4804186264827487E-2,-1.0297684563072393,1,0,1,0,1,0,1,2.5000000000000001E-3,null,3,1.4061897050268255E-2,3.4207095474599275E-5,0.98590389575425719,0,0,1,null,null,{"$f":"SUM($AQ$339:$AQ$379)","v":0.10250000000000005},{"$f":"Assumptions!S58","v":0.1317066071601824},{"$f":"$BC$339/$BB$339","v":1.2849425088798276},3.2123562721995693E-3,null,null,null,null,null,null,null,null,1,1,1,1,1,1,1,1,null,1,3.2123562721995693E-3,null,null,null,{"$f":"CB$149*(H$16+($BW339*MMULT($AD339:$AH339,CC$3:CC$7)))","v":-1.9390992924284878},-1.3770384308928696,-0.84347353202640363,0,-1.0297684563072393,0.14383344332247747,0.25232472470457834,0.43021356447237263,0,0.35708963284989204,1.1834613653493204,0.12153623897981863,0.21320909333622398,0.36352142711932733,0,0.30173324056463002,88.528775052006878,155.30462371917869,264.79432733948067,0,219.78690803567491]
[null,null,null,null,null,null,null,null,null,null,null,null,null,null,null,null,null,null,null,null,null,null,null,null,null,null,null,null,10,-1.4007262814280058E-3,1.4007262814280058E-3,-1.22929523679704,1.22929523679704,-1.4804186264827487E-2,-1.1318615472382731,10,0,1,0,1,0,1,2.5000000000000001E-3,null,2,1.6077828636681951E-6,0.81354608759991331,0.18645230451722297,0,1,0,null,null,null,null,1.2849425088798276,3.2123562721995693E-3,null,null,null,null,null,null,null,null,1,1,1,1,1,1,1,1,null,1,3.2123562721995693E-3,null,null,null,{"$f":"CB$149*(H$16+($BW340*MMULT($AD340:$AH340,CC$3:CC$7)))","v":-0.23771992970230915},-3.0784177936190478,-1.6008006196991551,0,-1.1318615472382731,0.78842347417205383,4.6032031235203594E-2,0.20173494035490955,0,0.32243247412169973,1.3586229198838666,0.5803107415849037,3.3881388692558162E-2,0.14848486463937588,0,0.23732300508316234,422.70683652275955,24.679699348859735,108.15854835255996,0,172.86954992216195]
[null,null,null,null,null,null,null,null,null,null,null,null,null,null,null,null,null,null,null,null,null,null,null,null,null,null,null,null,47,-3.6165135271371898E-2,3.6165135271371898E-2,-1.1376389253129218,1.1376389253129218,-1.4804186264827485E-2,-1.1246307754116565,47,0,1,0,1,0,1,2.5000000000000001E-3,null,3,2.3229466003714204E-5,0.31430350692749964,0.6856732635064966,0,0,1,null,null,null,null,1.2849425088798276,3.2123562721995693E-3,null,null,null,null,null,null,null,null,1,1,1,1,1,1,1,1,null,1,3.2123562721995693E-3,null,null,null,{"$f":"CB$149*(H$16+($BW341*MMULT($AD341:$AH341,CC$3:CC$7)))","v":-0.36414065017637109},-2.9519970731449856,-1.5439087172049808,0,-1.1246307754116565,0.69479346504682193,5.2235284031075288E-2,0.21354478186052553,0,0.32477235916410413,1.2853458901025268,0.54054980095000038,4.0639087449767075E-2,0.16613798939637325,0,0.25267312220385935,393.74438549687204,29.602106016763248,121.01734276396793,0,184.05079986873795]
[null,null,null,null,null,null,null,null,null,null,null,null,null,null,null,null,null,null,null,null,null,null,null,null,null,null,null,null,65,-0.68361033129371729,0.68361033129371729,6.7253523318946537E-3,-6.7253523318946537E-3,-1.4804186264827485E-2,-0.84451858806211666,65,0,1,0,1,0,1,2.5000000000000001E-3,null,3,0.2979441432229285,3.2184730385533415E-5,0.70202367194668591,0,0,1,null,null,null,null,1.2849425088798276,3.2123562721995693E-3,null,null,null,null,null,null,null,null,1,1,1,1,1,1,1,1,null,1,3.2123562721995693E-3,null,null,null,{"$f":"CB$149*(H$16+($BW342*MMULT($AD342:$AH342,CC$3:CC$7)))","v":-2.155950123843533},-1.1601875994778239,-1.0469896355825097,0,-0.84451858806211666,0.11579312052632311,0.31342737655476977,0.3509927764710809,0,0.42976420203553589,1.2099774755877097,9.5698575273130707E-2,0.2590357117206103,0.29008207471018982,0,0.35518363829606914,69.708242695903593,188.68540318380545,211.30002832243451,0,258.72095994419755]
[null,null,null,null,null,null,null,null,null,null,null,null,null,null,null,null,null,null,null,null,null,null,null,null,null,null,null,null,89,-1.233313675559888E-2,1.233313675559888E-2,-1.2004402325646846,1.2004402325646846,-1.4804186264827487E-2,-1.1295958770086294,89,0,1,0,1,0,1,2.5000000000000001E-3,null,2,2.6621419620762263E-7,0.59274452873797823,0.40725520494782558,0,1,0,null,null,null,null,1.2849425088798276,3.2123562721995693E-3,null,null,null,null,null,null,null,null,1,1,1,1,1,1,1,1,null,1,3.2123562721995693E-3,null,null,null,{"$f":"CB$149*(H$16+($BW343*MMULT($AD343:$AH343,CC$3:CC$7)))","v":-0.2775073444088354},-3.0386303789125217,-1.5828780259409705,0,-1.1295958770086294,0.75766999994429796,4.7900450053880793E-2,0.20538314876057878,0,0.32316382796985565,1.3341174267286131,0.56791852408537913,3.5904223342121691E-2,0.15394683005093368,0,0.24223042252156549,413.68016394658144,26.153161710060093,112.13712388953982,0,176.44418460015976]
[null,null,null,null,null,null,null,null,null,null,null,null,null,null,null,null,null,null,null,null,null,null,null,null,null,null,null,null,100,-0.39728981748391989,0.39728981748391989,-0.19579327742738808,0.19579327742738808,-1.4804186264827487E-2,-1.046867049697165,100,0,1,0,1,0,1,2.5000000000000001E-3,null,3,7.8924345128714569E-4,8.6736928552799217E-3,0.99053706359343296,0,0,1,null,null,null,null,1.2849425088798276,3.2123562721995693E-3,null,null,null,null,null,null,null,null,1,1,1,1,1,1,1,1,null,1,3.2123562721995693E-3,null,null,null,{"$f":"CB$149*(H$16+($BW344*MMULT($AD344:$AH344,CC$3:CC$7)))","v":-1.667110980274453},-1.6490267430469041,-0.9631877515319951,0,-1.046867049697165,0.18879170147768048,0.192236913516807,0.38167426195848969,0,0.35103580586867872,1.1137386828216558,0.16951166767358472,0.1726050432492611,0.34269642228060027,0,0.315186866796554,123.47477939199038,125.7280394302239,249.62508905878349,0,229.58672626534343]
[null,null,null,null,null,null,null,null,null,null,null,null,null,null,null,null,null,null,null,null,null,null,null,null,null,null,null,null,102,-8.3031893594315551E-2,8.3031893594315551E-2,-1.0155897751220284,1.0155897751220284,-1.4804186264827487E-2,-1.1144911436955589,102,0,1,0,1,0,1,2.5000000000000001E-3,null,3,2.2751869418240715E-4,0.13352060679570688,0.86625187441011076,0,0,1,null,null,null,null,1.2849425088798276,3.2123562721995693E-3,null,null,null,null,null,null,null,null,1,1,1,1,1,1,1,1,null,1,3.2123562721995693E-3,null,null,null,{"$f":"CB$149*(H$16+($BW345*MMULT($AD345:$AH345,CC$3:CC$7)))","v":-0.53305655869020829},-2.7830811646311489,-1.4687263253370311,0,-1.1144911436955589,0.58680861077993351,6.1847650704066268E-2,0.23021852202876267,0,0.32808218311810966,1.2069569666308722,0.48618851127556334,5.1242631190662281E-2,0.19074294145830237,0,0.27182591607547196,354.14682656694373,37.325882451442155,138.93994991834629,0,198.00197520960893]
[null,null,null,null,null,null,null,null,null,null,null,null,null,null,null,null,null,null,null,null,null,null,null,null,null,null,null,null,124,-0.5116840777945757,0.5116840777945757,1.3971062016147099E-3,-1.3971062016147099E-3,-1.4804186264827487E-2,-0.99608206413231848,124,0,1,0,1,0,1,2.5000000000000001E-3,null,3,0.14241996184896288,6.6424228439112441E-6,0.85757339562819324,{"$f":"IF($AS346= 1,1,0)","v":0},{"$f":"IF($AS346= 2,1,0)","v":0},{"$f":"IF($AS346= 3,1,0)","v":1},null,null,null,null,1.2849425088798276,{"$f":"AQ346*BD346","v":3.2123562721995693E-3},null,null,null,null,null,null,null,null,{"$f":"INDEX(AK$148:AK$149,2-AK346)","v":1},{"$f":"INDEX(AL$148:AL$149,2-AL346)","v":1},{"$f":"INDEX(AM$148:AM$149,2-AM346)","v":1},{"$f":"INDEX(AN$148:AN$149,2-AN346)","v":1},{"$f":"INDEX(AO$148:AO$149,2-AO346)","v":1},{"$f":"INDEX(AW$148:AW$149,2-AW346)","v":1},{"$f":"INDEX(AX$148:AX$149,2-AX346)","v":1},{"$f":"INDEX(AY$148:AY$149,2-AY346)","v":1},null,1,3.2123562721995693E-3,null,null,null,{"$f":"CB$149*(H$16+($BW346*MMULT($AD346:$AH346,CC$3:CC$7)))","v":-1.9786956242141116},-1.3374420991072455,-0.88039162821364814,0,-0.99608206413231848,{"$f":"$BW346*IF(CB$149=0,0,IF(ABS(CB346)>OverflowTrigger,OverflowTrigger,EXP(CB346)))","v":0.13824944898713967},{"$f":"$BW346*IF(CC$149=0,0,IF(ABS(CC346)>OverflowTrigger,OverflowTrigger,EXP(CC346)))","v":0.26251630118997255},{"$f":"$BW346*IF(CD$149=0,0,IF(ABS(CD346)>OverflowTrigger,OverflowTrigger,EXP(CD346)))","v":0.41462050279485457},{"$f":"$BW346*IF(CE$149=0,0,IF(ABS(CE346)>OverflowTrigger,OverflowTrigger,EXP(CE346)))","v":0},{"$f":"IF(L$12=\"\",0,$BW346*IF($CG$149=0,0,IF(ABS(CF346)>OverflowTrigger,OverflowTrigger,EXP(CF346))))","v":0.36932359643550289},1.1847098494074697,0.11669477472166274,{"$f":"IF($CL346=0,0,CH346/$CL346)","v":0.22158699982216706},{"$f":"IF($CL346=0,0,CI346/$CL346)","v":0.34997641236985261},{"$f":"IF($CL346=0,0,CJ346/$CL346)","v":0},{"$f":"IF($CL346=0,0,CK346/$CL346)","v":0.3117418130863176},{"$f":"CM346*$BX346*TargetMarketSize","v":85.002181635669672},{"$f":"CN346*$BX346*TargetMarketSize","v":161.40721340704917},{"$f":"CO346*$BX346*TargetMarketSize","v":254.92794037623523},{"$f":"CP346*$BX346*TargetMarketSize","v":0},{"$f":"CQ346*$BX346*TargetMarketSize","v":227.07729872738707}]
[null,null,null,null,null,null,null,null,null,null,null,null,null,null,null,null,null,null,null,null,null,null,null,null,null,null,null,null,126,-1.2141673171739162,1.2141673171739162,2.3693809546918274E-2,-2.3693809546918274E-2,-1.4804186264827487E-2,-0.37693616051518836,126,0,1,0,1,0,1,{"$f":"AP347/$AP$554","v":2.5000000000000001E-3},null,1,0.59326662245400053,1.4225313100991674E-5,0.40671915213289844,1,0,0,null,null,null,null,1.2849425088798276,3.2123562721995693E-3,null,null,null,null,null,null,null,null,1,1,1,1,1,1,1,1,null,{"$f":"IF(AND(BN347:BU347),1,0)","v":1},{"$f":"BE347*BW347","v":3.2123562721995693E-3},null,null,null,{"$f":"CB$149*(H$16+($BW347*MMULT($AD347:$AH347,CC$3:CC$7)))","v":-2.7034755669387556},-0.61266215638260135,-1.560578164247685,0,{"$f":"IF($CG$149=0,0,$L$16+$AI347)","v":-0.37693616051518836},6.6972340918423814E-2,0.54190630776759563,0.2100146131519815,0,0.68595986382255003,{"$f":"IF($CG$149=0,0,SUM(CG347:CK347))","v":1.5048531256605511},{"$f":"IF($CL347=0,0,CG347/$CL347)","v":4.4504237507581673E-2},0.36010577944590266,0.13955821307132293,0,0.45583176997519265,32.417537882046979,262.3063195890702,101.65624471646481,0,332.03453195875903]
[null,null,null,null,null,null,null,null,null,null,null,null,null,null,null,null,null,null,null,null,null,null,null,null,null,null,null,null,140,-0.64809315445925408,0.64809315445925408,-1.9392267451269984E-2,1.9392267451269984E-2,-1.4804186264827487E-2,-0.86936185755363948,140,0,1,0,1,0,1,2.5000000000000001E-3,null,3,5.8298310728058717E-2,1.7210157212272437E-3,0.93998067345071401,0,0,1,null,null,null,null,1.2849425088798276,3.2123562721995693E-3,null,null,null,null,null,null,null,null,1,1,1,1,1,1,1,1,null,1,3.2123562721995693E-3,null,null,null,{"$f":"CB$149*(H$16+($BW348*MMULT($AD348:$AH348,CC$3:CC$7)))","v":-2.0943153272259054},-1.221822396095452,-1.0375900785312111,0,-0.86936185755363948,0.12315453535192129,0.29469263057139622,0.35430750719324983,0,0.41921898533626673,1.1913736584528341,0.10337188041563278,0.24735533514657021,0.29739410862362686,0,0.35187867581417021,75.297590453972475,180.17724595493453,216.6262208303564,0,256.31357690707779]
[null,null,null,null,null,null,null,null,null,null,null,null,null,null,null,null,null,null,null,null,null,null,null,null,null,null,null,null,144,-0.33738801540141394,0.33738801540141394,-0.35009984398182109,0.35009984398182109,-1.4804186264827488E-2,-1.0602632161534691,144,0,1,0,1,0,1,2.5000000000000001E-3,null,3,6.7025368188610075E-4,2.3793783032892112E-2,0.97553596318522173,0,0,1,null,null,null,null,1.2849425088798276,3.2123562721995693E-3,null,null,null,null,null,null,null,null,1,1,1,1,1,1,1,1,null,1,3.2123562721995693E-3,null,null,null,{"$f":"CB$149*(H$16+($BW349*MMULT($AD349:$AH349,CC$3:CC$7)))","v":-1.4529026116375143},-1.8632351116838433,-1.0575925160039221,0,-1.0602632161534691,0.23389040883582524,0.15516982577567198,0.34729090198031909,0,0.34636462956496694,1.0827157661567832,0.21602198485207669,0.14331538398712348,0.32075906977236113,0,0.31990356138843867,157.35357506359188,104.39302299452295,233.64560045735513,0,233.02243563087114]
[null,null,null,null,null,null,null,null,null,null,null,null,null,null,null,null,null,null,null,null,null,null,null,null,null,null,null,null,202,-0.68502638997276277,0.68502638997276277,1.9599544956715961E-3,-1.9599544956715961E-3,-1.4804186264827487E-2,-0.84202696516976316,202,0,1,0,1,0,1,2.5000000000000001E-3,null,3,9.7454186010635158E-2,3.9369535056997659E-4,0.90215211853879484,0,0,1,null,null,null,null,1.2849425088798276,3.2123562721995693E-3,null,null,null,null,null,null,null,null,1,1,1,1,1,1,1,1,null,1,3.2123562721995693E-3,null,null,null,{"$f":"CB$149*(H$16+($BW350*MMULT($AD350:$AH350,CC$3:CC$7)))","v":-2.1526007846863555},-1.1635369386350016,-1.0531710920977784,0,-0.84202696516976316,0.11618160117258693,0.31237935803400674,0.34882982187830786,0,0.43083634749605532,1.2082271285809567,9.6158742362489696E-2,0.25854357235041664,0.28871212508529159,0,0.35658556020180215,70.04343513794521,188.32692166451682,210.30213696761535,0,259.74214037626382]
[null,null,null,null,null,null,null,null,null,null,null,null,null,null,null,null,null,null,null,null,null,null,null,null,null,null,null,null,238,-0.48060765919506965,0.48060765919506965,-3.1776223140452343E-2,3.1776223140452343E-2,-1.4804186264827487E-2,-1.0151509361376505,238,0,1,0,1,0,1,2.5000000000000001E-3,null,3,1.1830143413193939E-2,3.5592608946261009E-3,0.98461059559218,0,0,1,null,null,null,null,1.2849425088798276,3.2123562721995693E-3,null,null,null,null,null,null,null,null,1,1,1,1,1,1,1,1,null,1,3.2123562721995693E-3,null,null,null,{"$f":"CB$149*(H$16+($BW351*MMULT($AD351:$AH351,CC$3:CC$7)))","v":-1.9144458762725385},-1.4016918470488187,-0.88248853895620916,0,-1.0151509361376505,0.14742350081670805,0.24618011231993833,0.41375199152200653,0,0.36234773433732348,1.1697033389959763,0.12603494912073185,0.2104637168354575,0.35372386974389053,0,0.30977746429992015,91.805701353430607,153.3048512997789,257.65764316832406,0,225.64643832480755]
[null,null,null,null,null,null,null,null,null,null,null,null,null,null,null,null,null,null,null,null,null,null,null,null,null,null,null,null,285,-0.46617149516146189,0.46617149516146189,-7.3506115404750813E-2,7.3506115404750813E-2,-1.4804186264827487E-2,-1.0172050747589472,285,0,1,0,1,0,1,2.5000000000000001E-3,null,3,7.8937983133092506E-3,5.3727134992389821E-3,0.98673348808745176,0,0,1,null,null,null,null,1.2849425088798276,3.2123562721995693E-3,null,null,null,null,null,null,null,null,1,1,1,1,1,1,1,1,null,1,3.2123562721995693E-3,null,null,null,{"$f":"CB$149*(H$16+($BW352*MMULT($AD352:$AH352,CC$3:CC$7)))","v":-1.8582798199746322},-1.4578579033467249,-0.90978226718689981,0,-1.0172050747589472,0.15594064576853348,0.2327342804744178,0.4026118763073176,0,0.36160418579921566,1.1528909883494844,0.1352605296982875,0.20187015322897756,0.34921938012865344,0,0.31364993694408155,98.52574925461839,147.0451738093515,254.37650701322514,0,228.46720406914613]
[null,null,null,null,null,null,null,null,null,null,null,null,null,null,null,null,null,null,null,null,null,null,null,null,null,null,null,null,295,-1.1947149556478633,1.1947149556478633,2.315141759789208E-2,-2.315141759789208E-2,-1.4804186264827487E-2,-0.39410023462553584,295,0,1,0,1,0,1,2.5000000000000001E-3,null,1,0.6865899649241276,7.2773209250633277E-6,0.31340275765494735,1,0,0,null,null,null,null,1.2849425088798276,3.2123562721995693E-3,null,null,null,null,null,null,null,null,1,1,1,1,1,1,1,1,null,1,3.2123562721995693E-3,null,null,null,{"$f":"CB$149*(H$16+($BW353*MMULT($AD353:$AH353,CC$3:CC$7)))","v":-2.6834808134636767},-0.63265690985768042,-1.5416681946706583,0,-0.39410023462553584,6.8324913480403038E-2,0.53117863076497274,0.21402377014802254,0,0.67428646600163611,1.4878137803950344,4.5923027720755391E-2,0.35701956640295246,0.14385118149073492,0,0.45320622438555719,33.451005436106321,260.05827684449196,104.78330573709259,0,330.12204612865025]
[null,null,null,null,null,null,null,null,null,null,null,null,null,null,null,null,null,null,null,null,null,null,null,null,null,null,null,null,325,-0.46718166393759508,0.46718166393759508,-1.7888511584499226E-3,1.7888511584499226E-3,-1.4804186264827485E-2,-1.0348465770583286,325,0,1,0,1,0,1,2.5000000000000001E-3,null,3,1.0546989273318142E-3,4.3226359287490233E-4,0.99851303737979324,0,0,1,null,null,null,null,1.2849425088798276,3.2123562721995693E-3,null,null,null,null,null,null,null,null,1,1,1,1,1,1,1,1,null,1,3.2123562721995693E-3,null,null,null,{"$f":"CB$149*(H$16+($BW354*MMULT($AD354:$AH354,CC$3:CC$7)))","v":-1.9310072529970661},-1.3851304703242906,-0.83907517171673218,0,-1.0348465770583286,0.14500207113164354,0.25029114209483611,0.43210996621085179,0,0.3552808849822518,1.1826840644195833,0.12260423175888913,0.21162975778968457,0.36536381880051377,0,0.30040219165091248,89.306716621444437,154.15421259485186,266.13635240188631,0,218.81735252815847]
[null,null,null,null,null,null,null,null,null,null,null,null,null,null,null,null,null,null,null,null,null,null,null,null,null,null,null,null,336,-0.45613800852912789,0.45613800852912789,-4.0040975918437527E-2,4.0040975918437527E-2,-1.4804186264827485E-2,-1.0347818937943067,336,0,1,0,1,0,1,2.5000000000000001E-3,null,3,1.7871834623744971E-3,3.8378368067299696E-3,0.99437497963089549,0,0,1,null,null,null,null,1.2849425088798276,3.2123562721995693E-3,null,null,null,null,null,null,null,null,1,1,1,1,1,1,1,1,null,1,3.2123562721995693E-3,null,null,null,{"$f":"CB$149*(H$16+($BW355*MMULT($AD355:$AH355,CC$3:CC$7)))","v":-1.8817114728286113},-1.4344262504927454,-0.86628364106825262,0,-1.0347818937943067,0.15232917528836135,0.23825202178737623,0.42051142030469923,0,0.35530386645278728,1.1663964838332241,0.13059810913331077,0.20426332305494366,0.36052185181726387,0,0.3046167159944817,95.129573884544499,148.78839373258268,262.60939279323367,0,221.8872737359803]
[null,null,null,null,null,null,null,null,null,null,null,null,null,null,null,null,null,null,null,null,null,null,null,null,null,null,null,null,337,-0.67132951218272252,0.67132951218272252,4.3632157126855045E-3,-4.3632157126855045E-3,-1.4804186264827487E-2,-0.85483261850600134,337,0,1,0,1,0,1,2.5000000000000001E-3,null,3,0.13955831208651501,2.4921699373012468E-4,0.86019247081975492,0,0,1,null,null,null,null,1.2849425088798276,3.2123562721995693E-3,null,null,null,null,null,null,null,null,1,1,1,1,1,1,1,1,null,1,3.2123562721995693E-3,null,null,null,{"$f":"CB$149*(H$16+($BW356*MMULT($AD356:$AH356,CC$3:CC$7)))","v":-2.1413071681133293},-1.174830555208028,-1.0370709530907241,0,-0.85483261850600134,0.11750114883655605,0.30887131188937433,0.35449148498363342,0,0.42535438157598937,1.2062183272855531,9.7412836613897269E-2,0.25606584222978229,0.29388666791473245,0,0.35263465324158805,70.956935743269284,186.52210678518159,214.0713496895971,0,256.86424192829321]
[null,null,null,null,null,null,null,null,null,null,null,null,null,null,null,null,null,null,null,null,null,null,null,null,null,null,null,null,346,-1.5979500854765176E-2,1.5979500854765176E-2,-1.1908622247060372,1.1908622247060372,-1.4804186264827485E-2,-1.1288282470967601,346,0,1,0,1,0,1,2.5000000000000001E-3,null,3,1.3343668521918547E-5,0.40843512893262962,0.59155152729884852,0,0,1,null,null,null,null,1.2849425088798276,3.2123562721995693E-3,null,null,null,null,null,null,null,null,1,1,1,1,1,1,1,1,null,1,3.2123562721995693E-3,null,null,null,{"$f":"CB$149*(H$16+($BW357*MMULT($AD357:$AH357,CC$3:CC$7)))","v":-0.29073171636664896},-3.0254060069547077,-1.5769463821814895,0,-1.1288282470967601,0.74771625114421703,4.8538110458502925E-2,0.20660502872898126,0,0.32341199342806781,1.3262713837597691,0.56377319174644336,3.6597419693174017E-2,0.15577884832536215,0,0.24385054023502045,410.66064320750058,26.658096076503451,113.47159281065704,0,177.62430205168008]
[null,null,null,null,null,null,null,null,null,null,null,null,null,null,null,null,null,null,null,null,null,null,null,null,null,null,null,null,351,-0.30756467488030725,0.30756467488030725,-0.42141497053618765,0.42141497053618765,-1.4804186264827487E-2,-1.0683570868760832,351,0,1,0,1,0,1,2.5000000000000001E-3,null,3,1.8936311808572007E-5,4.8899924046627692E-2,0.9510811395415637,0,0,1,null,null,null,null,1.2849425088798276,3.2123562721995693E-3,null,null,null,null,null,null,null,null,1,1,1,1,1,1,1,1,null,1,3.2123562721995693E-3,null,null,null,{"$f":"CB$149*(H$16+($BW358*MMULT($AD358:$AH358,CC$3:CC$7)))","v":-1.3517641445620407},-1.9643735787593164,-1.0990843020371821,0,-1.0683570868760832,0.25878332651724623,0.1402437107447764,0.33317603267057094,0,0.34357251378524545,1.0757755837178391,0.2405551217503013,0.13036521079991378,0.3097077473343719,0,0.31937192011541293,175.22387100177426,94.959927330229831,225.59565546685394,0,232.63518034748299]
[null,null,null,null,null,null,null,null,null,null,null,null,null,null,null,null,null,null,null,null,null,null,null,null,null,null,null,null,354,-0.45986344417961894,0.45986344417961894,-2.0964629250020007E-2,2.0964629250020007E-2,-1.4804186264827488E-2,-1.0363994045733005,354,0,1,0,1,0,1,2.5000000000000001E-3,null,3,4.0252270781033144E-4,2.7272029771074026E-3,0.99687027421508223,0,0,1,null,null,null,null,1.2849425088798276,3.2123562721995693E-3,null,null,null,null,null,null,null,null,1,1,1,1,1,1,1,1,null,1,3.2123562721995693E-3,null,null,null,{"$f":"CB$149*(H$16+($BW359*MMULT($AD359:$AH359,CC$3:CC$7)))","v":-1.9045132551475203},-1.4116244681738372,-0.85093273005032621,0,-1.0363994045733005,0.14889509890980113,0.24374700212020678,0.42701645506231223,0,0.35472962316653572,1.174388179258856,0.1267852500046171,0.20755232931076753,0.36360758955509737,0,0.30205483112951786,92.352231497265564,151.18415402112365,264.85708931860921,0,220.02115930934261]
[null,null,null,null,null,null,null,null,null,null,null,null,null,null,null,null,null,null,null,null,null,null,null,null,null,null,null,null,355,-0.23230998308864581,0.23230998308864581,-0.62054563235475824,0.62054563235475824,-1.4804186264827487E-2,-1.0838229825724883,355,0,1,0,1,0,1,2.5000000000000001E-3,null,3,8.2622369325746116E-5,6.7623979316406346E-2,0.93229339821426793,0,0,1,null,null,null,null,1.2849425088798276,3.2123562721995693E-3,null,null,null,null,null,null,null,null,1,1,1,1,1,1,1,1,null,1,3.2123562721995693E-3,null,null,null,{"$f":"CB$149*(H$16+($BW360*MMULT($AD360:$AH360,CC$3:CC$7)))","v":-1.0773787909518089},-2.2387589323695485,-1.2229602720640913,0,-1.0838229825724883,0.34048684416523545,0.10659070860324675,0.29435749761496244,0,0.33829973633685889,1.0797347867203035,0.31534303456079699,9.8719342855495315E-2,0.27262018528556803,0,0.31331743729813966,229.70048115019992,71.908614009252844,198.58053252569476,0,228.22500646119357]
[null,null,null,null,null,null,null,null,null,null,null,null,null,null,null,null,null,null,null,null,null,null,null,null,null,null,null,null,359,-0.43704301118740752,0.43704301118740752,-9.0950990056411829E-2,9.0950990056411829E-2,-1.4804186264827487E-2,-1.0386071876190577,359,0,1,0,1,0,1,2.5000000000000001E-3,null,3,1.1883537924057485E-3,5.7729921356551375E-3,0.99303865397193913,0,0,1,null,null,null,null,1.2849425088798276,3.2123562721995693E-3,null,null,null,null,null,null,null,null,1,1,1,1,1,1,1,1,null,1,3.2123562721995693E-3,null,null,null,{"$f":"CB$149*(H$16+($BW361*MMULT($AD361:$AH361,CC$3:CC$7)))","v":-1.8117064613489169},-1.5044312619724403,-0.89809865786450649,0,-1.0386071876190577,0.16337510548944734,0.2221435994237195,0.40734342312703914,0,0.35394732101316123,1.1468094490533671,0.14246055055118806,0.19370576306908505,0.35519712840113099,0,0.30863655797859596,103.77034981002998,141.09811253800541,258.73078633414082,0,224.81538546416499]
[null,null,null,null,null,null,null,null,null,null,null,null,null,null,null,null,null,null,null,null,null,null,null,null,null,null,null,null,360,-0.4729179339044442,0.4729179339044442,1.2308415541373717E-4,-1.2308415541373717E-4,-1.4804186264827488E-2,-1.0302380148516856,360,0,1,0,1,0,1,2.5000000000000001E-3,null,3,2.0971713381563999E-2,2.2551132491951233E-5,0.97900573538594404,0,0,1,null,null,null,null,1.2849425088798276,3.2123562721995693E-3,null,null,null,null,null,null,null,null,1,1,1,1,1,1,1,1,null,1,3.2123562721995693E-3,null,null,null,{"$f":"CB$149*(H$16+($BW362*MMULT($AD362:$AH362,CC$3:CC$7)))","v":-1.9386554582777793},-1.3774822650435783,-0.84289950636971767,0,-1.0302380148516856,0.14389729568551946,0.25221275922357639,0.43046058898865619,0,0.35692199772198757,1.1834926416197395,0.12158697961026628,0.21310885285978251,0.36372054531705716,0,0.30158362221289409,88.565735269770741,155.23160708920491,264.93936794863185,0,219.67792383873359]
[null,null,null,null,null,null,null,null,null,null,null,null,null,null,null,null,null,null,null,null,null,null,null,null,null,null,null,null,362,-0.15833459442029116,0.15833459442029116,-0.81814564734174255,0.81814564734174255,-1.4804186264827487E-2,-1.0985465430081329,362,0,1,0,1,0,1,2.5000000000000001E-3,null,3,3.5772145545319428E-4,9.2797944622484668E-2,0.9068443338220622,0,0,1,null,null,null,null,1.2849425088798276,3.2123562721995693E-3,null,null,null,null,null,null,null,null,1,1,1,1,1,1,1,1,null,1,3.2123562721995693E-3,null,null,null,{"$f":"CB$149*(H$16+($BW363*MMULT($AD363:$AH363,CC$3:CC$7)))","v":-0.80580338729646983},-2.5103343360248873,-1.3465848983827209,0,-1.0985465430081329,0.44672888604236011,8.1241072882433499E-2,0.26012710595077104,0,0.3333552492737567,1.1214523141493213,0.39834853466883852,7.2442735065430752E-2,0.23195556571488346,0,0.29725316455084727,290.16290214353307,52.768348359246062,168.95982853841443,0,216.52355510514755]
[null,null,null,null,null,null,null,null,null,null,null,null,null,null,null,null,null,null,null,null,null,null,null,null,null,null,null,null,365,-0.45613800852912784,0.45613800852912784,-4.0040975918437666E-2,4.0040975918437666E-2,-1.4804186264827487E-2,-1.0347818937943067,365,0,1,0,1,0,1,2.5000000000000001E-3,null,3,1.7871834623745004E-3,3.8378368067299765E-3,0.99437497963089549,0,0,1,null,null,null,null,1.2849425088798276,3.2123562721995693E-3,null,null,null,null,null,null,null,null,1,1,1,1,1,1,1,1,null,1,3.2123562721995693E-3,null,null,null,{"$f":"CB$149*(H$16+($BW364*MMULT($AD364:$AH364,CC$3:CC$7)))","v":-1.8817114728286115},-1.4344262504927459,-0.86628364106825262,0,-1.0347818937943067,0.15232917528836132,0.23825202178737612,0.42051142030469923,0,0.35530386645278728,1.1663964838332239,0.13059810913331077,0.2042633230549436,0.36052185181726393,0,0.30461671599448176,95.129573884544499,148.78839373258262,262.60939279323372,0,221.88727373598036]
[null,null,null,null,null,null,null,null,null,null,null,null,null,null,null,null,null,null,null,null,null,null,null,null,null,null,null,null,368,-0.69940238687319389,0.69940238687319389,6.990427172537261E-3,-6.990427172537261E-3,-1.4804186264827487E-2,-0.83053893139040091,368,0,1,0,1,0,1,2.5000000000000001E-3,null,3,0.22031059895697838,5.3837917989818363E-5,0.77963556302503179,0,0,1,null,null,null,null,1.2849425088798276,3.2123562721995693E-3,null,null,null,null,null,null,null,null,1,1,1,1,1,1,1,1,null,1,3.2123562721995693E-3,null,null,null,{"$f":"CB$149*(H$16+($BW365*MMULT($AD365:$AH365,CC$3:CC$7)))","v":-2.1720072542636526},-1.1441304690577048,-1.0625166163213438,0,-0.83053893139040091,0.11394866326344348,0.31850074367040843,0.34558501017768517,0,0.4358143489866137,1.2138487660981507,9.3873855167085699E-2,0.26238914810962105,0.28470186717621254,0,0.35903512954708078,68.379089867439347,191.12809532423975,207.38100641994106,0,261.52644253472107]
[null,null,null,null,null,null,null,null,null,null,null,null,null,null,null,null,null,null,null,null,null,null,null,null,null,null,null,null,369,-0.23230998308864581,0.23230998308864581,-0.62054563235475824,0.62054563235475824,-1.4804186264827487E-2,-1.0838229825724883,369,0,1,0,1,0,1,2.5000000000000001E-3,null,3,8.2622369325745845E-5,6.762397931640611E-2,0.93229339821426815,0,0,1,null,null,null,null,1.2849425088798276,3.2123562721995693E-3,null,null,null,null,null,null,null,null,1,1,1,1,1,1,1,1,null,1,3.2123562721995693E-3,null,null,null,{"$f":"CB$149*(H$16+($BW366*MMULT($AD366:$AH366,CC$3:CC$7)))","v":-1.0773787909518089},-2.2387589323695485,-1.2229602720640913,0,-1.0838229825724883,0.34048684416523545,0.10659070860324675,0.29435749761496244,0,0.33829973633685889,1.0797347867203035,0.31534303456079699,9.8719342855495315E-2,0.27262018528556803,0,0.31331743729813966,229.70048115019992,71.908614009252844,198.58053252569476,0,228.22500646119357]
[null,null,null,null,null,null,null,null,null,null,null,null,null,null,null,null,null,null,null,null,null,null,null,null,null,null,null,null,373,-0.59800031462348446,0.59800031462348446,-4.9539839694448411E-2,4.9539839694448411E-2,-1.4804186264827485E-2,-0.90612942968632304,373,0,1,0,1,0,1,2.5000000000000001E-3,null,3,5.0520663595886341E-2,4.817582380832716E-3,0.944661753923281,0,0,1,null,null,null,null,1.2849425088798276,3.2123562721995693E-3,null,null,null,null,null,null,null,null,1,1,1,1,1,1,1,1,null,1,3.2123562721995693E-3,null,null,null,{"$f":"CB$149*(H$16+($BW367*MMULT($AD367:$AH367,CC$3:CC$7)))","v":-2.0140749151469572},-1.3020628081743997,-1.01764481093862,0,-0.90612942968632304,0.13344379311589957,0.27197019166065289,0.36144521031219701,0,0.40408524141063518,1.1709444364993846,0.11396253225715694,0.2322656679370079,0.30867836171010915,0,0.34509343809572601,83.01197624048757,169.18571153509117,224.84583591396111,0,251.37111045680126]
[null,null,null,null,null,null,null,null,null,null,null,null,null,null,null,null,null,null,null,null,null,null,null,null,null,null,null,null,376,-6.4011950960552689E-3,6.4011950960552689E-3,-1.2160969513633104,1.2160969513633104,-1.4804186264827487E-2,-1.1308252453535852,376,0,1,0,1,0,1,2.5000000000000001E-3,null,2,9.5292308635947264E-7,0.67248791065230606,0.3275111363246076,0,1,0,null,null,null,null,1.2849425088798276,3.2123562721995693E-3,null,null,null,null,null,null,null,null,1,1,1,1,1,1,1,1,null,1,3.2123562721995693E-3,null,null,null,{"$f":"CB$149*(H$16+($BW368*MMULT($AD368:$AH368,CC$3:CC$7)))","v":-0.25591868395066597},-3.0602190393706912,-1.5926028030800528,0,-1.1308252453535852,0.77420492151827303,4.687742609344691E-2,0.20339552368055983,0,0.322766784695737,1.3472446559880167,0.5746580014826641,3.4795035842297574E-2,0.15097148300165086,0,0.23957547967338749,418.58929790926231,25.345213303176013,109.96983755717808,0,174.51028537672474]
[null,null,null,null,null,null,null,null,null,null,null,null,null,null,null,null,null,null,null,null,null,null,null,null,null,null,null,null,377,-0.36904009542549104,0.36904009542549104,-0.25907082653687435,0.25907082653687435,-1.4804186264827487E-2,-1.0556389214201183,377,0,1,0,1,0,1,2.5000000000000001E-3,null,3,4.3158133329317683E-6,3.5162937679208743E-2,0.96483274640745831,0,0,1,null,null,null,null,1.2849425088798276,3.2123562721995693E-3,null,null,null,null,null,null,null,null,1,1,1,1,1,1,1,1,null,1,3.2123562721995693E-3,null,null,null,{"$f":"CB$149*(H$16+($BW369*MMULT($AD369:$AH369,CC$3:CC$7)))","v":-1.5755837091065379},-1.7405540142148193,-0.99821557858305254,0,-1.0556389214201183,0.20688675574609583,0.17542318675148247,0.36853647916711607,0,0.34797003076059257,1.098816452425287,0.18828145072769822,0.15964739731034397,0.33539403087175229,0,0.3166771210902054,137.14696404835865,116.28950050422976,244.30592029231411,0,230.67224930143854]
[null,null,null,null,null,null,null,null,null,null,null,null,null,null,null,null,null,null,null,null,null,null,null,null,null,null,null,null,379,-1.0557329755306213,1.0557329755306213,1.4057622733514349E-2,-1.4057622733514349E-2,-1.4804186264827487E-2,-0.51538392363935936,379,0,1,0,1,0,1,2.5000000000000001E-3,null,3,0.38347632188432734,7.0110332093649614E-4,0.61582257469473622,0,0,1,null,null,null,null,1.2849425088798276,3.2123562721995693E-3,null,null,null,null,null,null,null,null,1,1,1,1,1,1,1,1,null,1,3.2123562721995693E-3,null,null,null,{"$f":"CB$149*(H$16+($BW370*MMULT($AD370:$AH370,CC$3:CC$7)))","v":-2.5354050384820566},-0.78073268483930036,-1.4117800094177941,0,-0.51538392363935936,7.9229621719084792E-2,0.45807026718282995,0.24370909235662855,0,0.59727124404480281,1.3782802253033459,5.7484407208735169E-2,0.3323491542382197,0.17682114847362812,0,0.43334529007941713,41.87248344607012,242.08798759327871,128.7991121747537,0,315.65505093223874]
[null,null,null,null,null,null,null,null,null,null,null,null,null,null,null,null,null,null,null,null,null,null,null,null,null,null,null,null,382,-0.69940238687319423,0.69940238687319423,6.9904271725372722E-3,-6.9904271725372722E-3,-1.4804186264827488E-2,-0.8305389313904008,382,0,1,0,1,0,1,2.5000000000000001E-3,null,3,0.22031059895697838,5.3837917989818363E-5,0.77963556302503179,0,0,1,null,null,null,null,1.2849425088798276,3.2123562721995693E-3,null,null,null,null,null,null,null,null,1,1,1,1,1,1,1,1,null,1,3.2123562721995693E-3,null,null,null,{"$f":"CB$149*(H$16+($BW371*MMULT($AD371:$AH371,CC$3:CC$7)))","v":-2.172007254263653},-1.1441304690577048,-1.0625166163213442,0,-0.8305389313904008,0.11394866326344343,0.31850074367040843,0.345585010177685,0,0.43581434898661375,1.2138487660981507,9.3873855167085643E-2,0.26238914810962105,0.28470186717621238,0,0.35903512954708083,68.379089867439305,191.12809532423975,207.38100641994095,0,261.52644253472113]
[null,null,null,null,null,null,null,null,null,null,null,null,null,null,null,null,null,null,null,null,null,null,null,null,null,null,null,null,383,-0.49533007003172325,0.49533007003172325,-5.6941001404720911E-3,5.6941001404720911E-3,-1.4804186264827488E-2,-1.0087969481908179,383,0,1,0,1,0,1,2.5000000000000001E-3,null,3,2.0480854929398339E-2,8.4323537121522968E-4,0.97867590959938644,0,0,1,null,null,null,null,1.2849425088798276,3.2123562721995693E-3,null,null,null,null,null,null,null,null,1,1,1,1,1,1,1,1,null,1,3.2123562721995693E-3,null,null,null,{"$f":"CB$149*(H$16+($BW372*MMULT($AD372:$AH372,CC$3:CC$7)))","v":-1.9552504101091726},-1.360887313212185,-0.8711288267928825,0,-1.0087969481908179,0.14152903195611566,0.25643313946292723,0.41847889233801056,0,0.36465741755275805,1.1810984813098115,0.1198283074576162,0.21711410481075943,0.35431329305743153,0,0.30874429467419279,87.284692737114796,158.1490912237397,258.08698773561434,0,224.89386244987227]
[null,null,null,null,null,null,null,null,null,null,null,null,null,null,null,null,null,null,null,null,null,null,null,null,null,null,null,null,384,-1.4887617738662269E-2,1.4887617738662269E-2,-1.1937028750177208,1.1937028750177208,-1.4804186264827487E-2,-1.1290652006503556,384,0,1,0,1,0,1,2.5000000000000001E-3,null,2,1.8491393834205131E-6,0.57684407784618885,0.42315407291442775,0,1,0,null,null,null,null,1.2849425088798276,3.2123562721995693E-3,null,null,null,null,null,null,null,null,1,1,1,1,1,1,1,1,null,1,3.2123562721995693E-3,null,null,null,{"$f":"CB$149*(H$16+($BW373*MMULT($AD373:$AH373,CC$3:CC$7)))","v":-0.28679918293886275},-3.0293385403824944,-1.5786951493770702,0,-1.1290652006503556,0.75066245953094302,4.8347607541655263E-2,0.20624404036659855,0,0.32333536888553699,1.3285894763247337,0.56500707924278804,3.6390178006978392E-2,0.15523534097013156,0,0.24336740178010216,411.55942491672823,26.507138199473395,113.07569409934091,0,177.27237693079871]
[null,null,null,null,null,null,null,null,null,null,null,null,null,null,null,null,null,null,null,null,null,null,null,null,null,null,null,null,386,-0.46905208404199128,0.46905208404199128,-8.1347777079349825E-3,8.1347777079349825E-3,-1.4804186264827487E-2,-1.0315421733059473,386,0,1,0,1,0,1,2.5000000000000001E-3,null,3,3.1177920065958969E-3,9.1621084157102639E-4,0.99596599705183309,0,0,1,null,null,null,null,1.2849425088798276,3.2123562721995693E-3,null,null,null,null,null,null,null,null,1,1,1,1,1,1,1,1,null,1,3.2123562721995693E-3,null,null,null,{"$f":"CB$149*(H$16+($BW374*MMULT($AD374:$AH374,CC$3:CC$7)))","v":-1.9265317465519776},-1.3896059767693796,-0.84729151837061334,0,-1.0315421733059473,0.14565248321161797,0.24917346542541347,0.42857414658715753,0,0.35645681828092945,1.1798569135051185,0.1234492772338924,0.21118956254209592,0.36324247599986481,0,0.30211868422414689,89.922260111955978,153.83356793462664,264.59113526185263,0,220.06767083790592]
[null,null,null,null,null,null,null,null,null,null,null,null,null,null,null,null,null,null,null,null,null,null,null,null,null,null,null,null,390,-0.15833459442029096,0.15833459442029096,-0.81814564734174311,0.81814564734174311,-1.4804186264827487E-2,-1.0985465430081329,390,0,1,0,1,0,1,2.5000000000000001E-3,null,3,3.5772145545319309E-4,9.2797944622484349E-2,0.90684433382206242,0,0,1,null,null,null,null,1.2849425088798276,3.2123562721995693E-3,null,null,null,null,null,null,null,null,1,1,1,1,1,1,1,1,null,1,3.2123562721995693E-3,null,null,null,{"$f":"CB$149*(H$16+($BW375*MMULT($AD375:$AH375,CC$3:CC$7)))","v":-0.80580338729646905},-2.5103343360248882,-1.3465848983827211,0,-1.0985465430081329,0.44672888604236044,8.1241072882433429E-2,0.26012710595077099,0,0.3333552492737567,1.1214523141493218,0.39834853466883863,7.2442735065430655E-2,0.23195556571488332,0,0.29725316455084716,290.16290214353319,52.768348359245991,168.95982853841431,0,216.52355510514747]
[null,null,null,null,null,null,null,null,null,null,null,null,null,null,null,null,null,null,null,null,null,null,null,null,null,null,null,null,392,-0.46452459020651721,0.46452459020651721,-1.7162845032939317E-2,1.7162845032939317E-2,-1.4804186264827487E-2,-1.0332358011502882,392,0,1,0,1,0,1,2.5000000000000001E-3,null,3,2.6852156069177863E-3,2.5489345640741607E-3,0.99476584972900806,0,0,1,null,null,null,null,1.2849425088798276,3.2123562721995693E-3,null,null,null,null,null,null,null,null,1,1,1,1,1,1,1,1,null,1,3.2123562721995693E-3,null,null,null,{"$f":"CB$149*(H$16+($BW376*MMULT($AD376:$AH376,CC$3:CC$7)))","v":-1.9129761853914991},-1.4031615379298581,-0.8517920918601436,0,-1.0332358011502882,0.14764032708627628,0.24581856939701438,0.42664965105991753,0,0.35585362402565912,1.1759621715688673,0.12554853434554555,0.20903611981758261,0.36280899281880674,0,0.3026063530180651,91.451389712919905,152.26496874029516,264.27537976911361,0,220.42289592401244]
[null,null,null,null,null,null,null,null,null,null,null,null,null,null,null,null,null,null,null,null,null,null,null,null,null,null,null,null,393,-0.38856553291738266,0.38856553291738266,-0.20879119168150179,0.20879119168150179,-1.4804186264827488E-2,-1.0512677560849732,393,0,1,0,1,0,1,2.5000000000000001E-3,null,3,1.5171153252326126E-4,1.6992316721239444E-2,0.98285597164623728,0,0,1,null,null,null,null,1.2849425088798276,3.2123562721995693E-3,null,null,null,null,null,null,null,null,1,1,1,1,1,1,1,1,null,1,3.2123562721995693E-3,null,null,null,{"$f":"CB$149*(H$16+($BW377*MMULT($AD377:$AH377,CC$3:CC$7)))","v":-1.6453887814538022},-1.6707489418675552,-0.96746138121957159,0,-1.0512677560849732,0.19293753767412922,0.18810613231186765,0.38004660797407097,0,0.34949439449249581,1.1105846724525636,0.17372609442560999,0.16937576843777502,0.34220408168860611,0,0.31469405544800882,126.54462951270342,123.3757883998573,249.26646096659067,0,229.22775526718971]
[null,null,null,null,null,null,null,null,null,null,null,null,null,null,null,null,null,null,null,null,null,null,null,null,null,null,null,null,394,-0.57605366400995395,0.57605366400995395,-0.11501311563762205,0.11501311563762205,-1.4804186264827487E-2,-0.90872662816600069,394,0,1,0,1,0,1,2.5000000000000001E-3,null,3,3.4130943562533413E-2,7.3628548829589953E-3,0.9585062014545076,0,0,1,null,null,null,null,1.2849425088798276,3.2123562721995693E-3,null,null,null,null,null,null,null,null,1,1,1,1,1,1,1,1,null,1,3.2123562721995693E-3,null,null,null,{"$f":"CB$149*(H$16+($BW378*MMULT($AD378:$AH378,CC$3:CC$7)))","v":-1.9266549885902531},-1.3894827347311041,-1.0611714362682632,0,-0.90872662816600069,0.1456345338087903,0.24920417596355246,0.34605019704992396,0,0.40303711352323468,1.1439260203455013,0.12731114706596511,0.217849905965322,0.30251099362649869,0,0.35232795334221434,92.735302612806009,158.68505955254486,220.35343474769218,0,256.64083723329821]
[null,null,null,null,null,null,null,null,null,null,null,null,null,null,null,null,null,null,null,null,null,null,null,null,null,null,null,null,400,-0.46798152190438697,0.46798152190438697,-7.2436763958307225E-3,7.2436763958307225E-3,-1.4804186264827487E-2,-1.0327248809570941,400,0,1,0,1,0,1,2.5000000000000001E-3,null,3,4.0309306443173966E-3,1.6914026501620484E-3,0.99427766660552053,0,0,1,null,null,null,null,1.2849425088798276,3.2123562721995693E-3,null,null,null,null,null,null,null,null,1,1,1,1,1,1,1,1,null,1,3.2123562721995693E-3,null,null,null,{"$f":"CB$149*(H$16+($BW379*MMULT($AD379:$AH379,CC$3:CC$7)))","v":-1.9263522857264774},-1.3897854375948797,-0.84532985492090484,0,-1.0327248809570941,0.14567862447208721,0.2491287525618392,0.42941568996859036,0,0.35603548328182227,1.180258550284339,0.12342941674685722,0.21107981170890139,0.36383188231522556,0,0.30165888922901585,89.907793442558273,153.75362382161796,265.02046744741966,0,219.73274943474522]
[null,null,null,null,null,null,null,null,null,null,null,null,null,null,null,null,null,null,null,null,null,null,null,null,null,null,null,null,7,-6.2303218561881853E-4,6.2303218561881853E-4,-1.2313502613401943,1.2313502613401943,-1.4804186264827487E-2,-1.1320221042835041,7,0,1,0,0,1,1,2.5000000000000001E-3,null,2,2.820254735998339E-6,0.97074160401408782,2.9255575631176128E-2,0,1,0,null,null,{"$f":"SUM($AQ$380:$AQ$423)","v":0.11000000000000006},{"$f":"Assumptions!S59","v":0.12332748264639212},{"$f":"$BC$380/$BB$380","v":1.1211589331490188},2.8028973328725472E-3,null,null,null,null,null,null,null,null,1,1,1,1,1,1,1,1,null,1,2.8028973328725472E-3,null,null,null,{"$f":"CB$149*(H$16+($BW380*MMULT($AD380:$AH380,CC$3:CC$7)))","v":-0.23488721106334576},-3.0812505122580114,-1.6020779501465003,0,-1.1320221042835041,0.79066002230296606,4.590181995536511E-2,0.20147742267590016,0,0.32238070947206904,1.3604199744063004,0.58118818980735509,3.3740918847797043E-2,0.14809942993069236,0,0.23697146141415551,369.38472109006091,21.444654444969181,94.127285409359331,0,150.61152087379219]
[null,null,null,null,null,null,null,null,null,null,null,null,null,null,null,null,null,null,null,null,null,null,null,null,null,null,null,null,9,-1.0289970130862001E-4,1.0289970130862001E-4,-1.2327167366401388,1.2327167366401388,-1.4804186264827487E-2,-1.1321315431054038,9,0,1,0,0,1,1,2.5000000000000001E-3,null,2,5.5329397278926616E-8,0.99331702115811749,6.6829234124851974E-3,0,1,0,null,null,null,null,1.1211589331490188,2.8028973328725472E-3,null,null,null,null,null,null,null,null,1,1,1,1,1,1,1,1,null,1,2.8028973328725472E-3,null,null,null,{"$f":"CB$149*(H$16+($BW381*MMULT($AD381:$AH381,CC$3:CC$7)))","v":-0.233000603279091},-3.0831371200422661,-1.6029242929621346,0,-1.1321315431054038,0.79215309563477043,4.5815302862098277E-2,0.20130697584510546,0,0.32234543043750441,1.3616208047794784,0.58177217390789193,3.3647622525507973E-2,0.14784363982871734,0,0.2367365637378829,369.75588280304981,21.385358271041593,93.964713359319973,0,150.46222738477027]
[null,null,null,null,null,null,null,null,null,null,null,null,null,null,null,null,null,null,null,null,null,null,null,null,null,null,null,null,20,-2.4372363746206531E-4,2.4372363746206531E-4,-1.2323452531369878,1.2323452531369878,-1.4804186264827488E-2,-1.1321023047068335,20,0,1,0,0,1,1,2.5000000000000001E-3,null,2,1.2474607770653828E-7,0.98996763088789985,1.003224426602246E-2,0,1,0,null,null,null,null,1.1211589331490188,2.8028973328725472E-3,null,null,null,null,null,null,null,null,1,1,1,1,1,1,1,1,null,1,2.8028973328725472E-3,null,null,null,{"$f":"CB$149*(H$16+($BW382*MMULT($AD382:$AH382,CC$3:CC$7)))","v":-0.23351291071839575},-3.0826248126029618,-1.6026936333951372,0,-1.1321023047068335,0.79174737364687853,4.5838780395932643E-2,0.20135341458055087,0,0.32235485543946218,1.3612944240628242,0.58161361690139346,3.3672936277168775E-2,0.14791320012874623,0,0.23680024669269151,369.65510901471504,21.401446886159647,94.00892367273606,0,150.5027022445708]
[null,null,null,null,null,null,null,null,null,null,null,null,null,null,null,null,null,null,null,null,null,null,null,null,null,null,null,null,22,-7.2354747557555792E-3,7.2354747557555792E-3,-1.2139717908932623,1.2139717908932623,-1.4804186264827487E-2,-1.1306324826488738,22,0,1,0,0,1,1,2.5000000000000001E-3,null,2,4.0342394159186634E-5,0.8399821397739049,0.15997751773193591,0,1,0,null,null,null,null,1.1211589331490188,2.8028973328725472E-3,null,null,null,null,null,null,null,null,1,1,1,1,1,1,1,1,null,1,2.8028973328725472E-3,null,null,null,{"$f":"CB$149*(H$16+($BW383*MMULT($AD383:$AH383,CC$3:CC$7)))","v":-0.25887812408041433},-3.0572595992409428,-1.591311922269705,0,-1.1306324826488738,0.77191709541685638,4.7016362515014176E-2,0.20365825259836515,0,0.32282900809112824,1.345420718621364,0.5737365901484186,3.4945472345030676E-2,0.15137142588903435,0,0.23994651161751629,364.64872144319361,22.210230321108693,96.206861931519171,0,152.50236812236002]
[null,null,null,null,null,null,null,null,null,null,null,null,null,null,null,null,null,null,null,null,null,null,null,null,null,null,null,null,34,-2.8539444850367137E-3,2.8539444850367137E-3,-1.2254601566483128,1.2254601566483128,-1.4804186264827487E-2,-1.1315602366868709,34,0,1,0,0,1,1,2.5000000000000001E-3,null,2,1.9577329015855485E-6,0.93981119230800247,6.0186849859095989E-2,0,1,0,null,null,null,null,1.1211589331490188,2.8028973328725472E-3,null,null,null,null,null,null,null,null,1,1,1,1,1,1,1,1,null,1,2.8028973328725472E-3,null,null,null,{"$f":"CB$149*(H$16+($BW384*MMULT($AD384:$AH384,CC$3:CC$7)))","v":-0.24300822805464506},-3.0731294952667119,-1.5984187577540365,0,-1.1315602366868709,0.78426506076923241,4.6276107154459532E-2,0.20221601783497287,0,0.32252964106624499,1.3552868268249099,0.57867090954212597,3.41448808020016E-2,0.14920532970036551,0,0.23797887995550682,367.78481784876243,21.701399809726691,94.830160115243643,0,151.25180404444876]
[null,null,null,null,null,null,null,null,null,null,null,null,null,null,null,null,null,null,null,null,null,null,null,null,null,null,null,null,53,-5.2956625453166912E-5,5.2956625453166912E-5,-1.232848904405323,1.232848904405323,-1.4804186264827488E-2,-1.1321418035130641,53,0,1,0,0,1,1,2.5000000000000001E-3,null,2,1.7490873472918516E-7,0.99525352883475793,4.746296156507384E-3,0,1,0,null,null,null,null,1.1211589331490188,2.8028973328725472E-3,null,null,null,null,null,null,null,null,1,1,1,1,1,1,1,1,null,1,2.8028973328725472E-3,null,null,null,{"$f":"CB$149*(H$16+($BW385*MMULT($AD385:$AH385,CC$3:CC$7)))","v":-0.23281849243805164},-3.0833192308833057,-1.6030065176514634,0,-1.1321418035130641,0.7922973684376704,4.5806960158433024E-2,0.20129042412204634,0,0.32234212305894822,1.361736875777098,0.58182853275933544,3.3638627970835049E-2,0.14781888315037117,0,0.23671395611945831,369.79170269579112,21.379641618281859,93.948978802275633,0,150.44785870183293]
[null,null,null,null,null,null,null,null,null,null,null,null,null,null,null,null,null,null,null,null,null,null,null,null,null,null,null,null,60,-7.786180618310222E-4,7.786180618310222E-4,-1.2309817677109969,1.2309817677109969,-1.4804186264827487E-2,-1.1319789611319064,60,0,1,0,0,1,1,2.5000000000000001E-3,null,2,2.0089509384240196E-5,0.96880658837716838,3.1173322013447392E-2,0,1,0,null,null,null,null,1.1211589331490188,2.8028973328725472E-3,null,null,null,null,null,null,null,null,1,1,1,1,1,1,1,1,null,1,2.8028973328725472E-3,null,null,null,{"$f":"CB$149*(H$16+($BW386*MMULT($AD386:$AH386,CC$3:CC$7)))","v":-0.23541129056875532},-3.0807264327526021,-1.601865042393515,0,-1.1319789611319064,0.79024576215163966,4.5925882463247567E-2,0.20152032334802017,0,0.32239461829192295,1.3600865862548304,0.58102606858853068,3.3766881408418464E-2,0.14816727507248767,0,0.23703977493056314,369.28168200177851,21.461155422418681,94.170405622775363,0,150.654938771209]
[null,null,null,null,null,null,null,null,null,null,null,null,null,null,null,null,null,null,null,null,null,null,null,null,null,null,null,null,74,-1.4728278102086924E-3,1.4728278102086924E-3,-1.2291149313408067,1.2291149313408067,-1.4804186264827487E-2,-1.1318440196778283,74,0,1,0,0,1,1,2.5000000000000001E-3,null,2,6.2869438881790618E-6,0.95657064057596097,4.3423072380150841E-2,0,1,0,null,null,null,null,1.1211589331490188,2.8028973328725472E-3,null,null,null,null,null,null,null,null,1,1,1,1,1,1,1,1,null,1,2.8028973328725472E-3,null,null,null,{"$f":"CB$149*(H$16+($BW387*MMULT($AD387:$AH387,CC$3:CC$7)))","v":-0.2379723366873232},-3.0781653866340339,-1.6006924157717026,0,-1.1318440196778283,0.78822449569285913,4.6043651507879035E-2,0.20175677004876835,0,0.32243812562590768,1.3584630428754141,0.58023256490250208,3.3893930165681908E-2,0.14851840917344092,0,0.23735509575837521,368.7773563067833,21.541903570074865,94.393575284892592,0,150.85534665643092]
[null,null,null,null,null,null,null,null,null,null,null,null,null,null,null,null,null,null,null,null,null,null,null,null,null,null,null,null,82,-5.4518395929192259E-3,5.4518395929192259E-3,-1.2212468843841677,1.2212468843841677,-1.4804186264827487E-2,-1.1303384217379249,82,0,1,0,0,1,1,2.5000000000000001E-3,null,2,1.2178518717539926E-3,0.78859168720381689,0.21019046082442908,0,1,0,null,null,null,null,1.1211589331490188,2.8028973328725472E-3,null,null,null,null,null,null,null,null,1,1,1,1,1,1,1,1,null,1,2.8028973328725472E-3,null,null,null,{"$f":"CB$149*(H$16+($BW388*MMULT($AD388:$AH388,CC$3:CC$7)))","v":-0.24981939542667275},-3.0663183278946846,-1.5968033805977742,0,-1.1303384217379249,0.77894145075676968,4.6592377327456386E-2,0.2025429369485581,0,0.32292395344250235,1.3510007184752866,0.57656627424733575,3.4487307586364313E-2,0.14992067300833428,0,0.23902574515796565,366.44717862106222,21.919035378469946,95.284809560865142,0,151.91715825778425]
[null,null,null,null,null,null,null,null,null,null,null,null,null,null,null,null,null,null,null,null,null,null,null,null,null,null,null,null,83,-9.0315799042321333E-3,9.0315799042321333E-3,-1.2097523063289959,1.2097523063289959,-1.4804186264827487E-2,-1.1301255242174673,83,0,1,0,0,1,1,2.5000000000000001E-3,null,2,2.8479077600650899E-4,0.83078137107363914,0.16893383805035439,0,1,0,null,null,null,null,1.1211589331490188,2.8028973328725472E-3,null,null,null,null,null,null,null,null,1,1,1,1,1,1,1,1,null,1,2.8028973328725472E-3,null,null,null,{"$f":"CB$149*(H$16+($BW389*MMULT($AD389:$AH389,CC$3:CC$7)))","v":-0.26489371379315751},-3.0512440095281996,-1.5888885428539152,0,-1.1301255242174673,0.76728749771976901,4.7300046068143607E-2,0.20415239231774934,0,0.32299271047032729,1.3417326465759891,0.57186317980548118,3.5252959066659158E-2,0.15215579112480598,0,0.24072807000305377,363.45804143773347,22.405659097707339,96.705379518299949,0,152.99910176444081]
[null,null,null,null,null,null,null,null,null,null,null,null,null,null,null,null,null,null,null,null,null,null,null,null,null,null,null,null,87,-0.41163567665136347,0.41163567665136347,-0.18594321271631473,0.18594321271631473,-1.4804186264827487E-2,-1.036651771356919,87,0,1,0,0,1,1,2.5000000000000001E-3,null,3,1.26497879248447E-2,4.1802186101988777E-2,0.94554802587316655,0,0,1,null,null,null,null,1.1211589331490188,2.8028973328725472E-3,null,null,null,null,null,null,null,null,1,1,1,1,1,1,1,1,null,1,2.8028973328725472E-3,null,null,null,{"$f":"CB$149*(H$16+($BW390*MMULT($AD390:$AH390,CC$3:CC$7)))","v":-1.69130690415297},-1.6248308191683871,-0.96768354598836537,0,-1.036651771356919,0.18427853217168597,0.19694499170333643,0.37996218438560031,0,0.35464011248771909,1.1158258207483418,0.16514990847594599,0.17650155431181269,0.34052105384223336,0,0.31782748337000799,104.96402705749608,112.17877196204182,216.42434706131937,0,202.00103573732432]
[null,null,null,null,null,null,null,null,null,null,null,null,null,null,null,null,null,null,null,null,null,null,null,null,null,null,null,null,90,-2.4372363746206531E-4,2.4372363746206531E-4,-1.2323452531369878,1.2323452531369878,-1.4804186264827488E-2,-1.1321023047068335,90,0,1,0,0,1,1,2.5000000000000001E-3,null,2,1.2474607770653828E-7,0.98996763088789985,1.003224426602246E-2,0,1,0,null,null,null,null,1.1211589331490188,2.8028973328725472E-3,null,null,null,null,null,null,null,null,1,1,1,1,1,1,1,1,null,1,2.8028973328725472E-3,null,null,null,{"$f":"CB$149*(H$16+($BW391*MMULT($AD391:$AH391,CC$3:CC$7)))","v":-0.23351291071839575},-3.0826248126029618,-1.6026936333951372,0,-1.1321023047068335,0.79174737364687853,4.5838780395932643E-2,0.20135341458055087,0,0.32235485543946218,1.3612944240628242,0.58161361690139346,3.3672936277168775E-2,0.14791320012874623,0,0.23680024669269151,369.65510901471504,21.401446886159647,94.00892367273606,0,150.5027022445708]
[null,null,null,null,null,null,null,null,null,null,null,null,null,null,null,null,null,null,null,null,null,null,null,null,null,null,null,null,106,-1.4914249997197566,1.4914249997197566,3.2676695844877833E-2,-3.2676695844877833E-2,-1.4804186264827487E-2,-0.13261749700387263,106,0,1,0,0,1,1,2.5000000000000001E-3,null,1,0.99392836479276747,1.0040195006423079E-6,6.0706310877318842E-3,1,0,0,null,null,null,null,1.1211589331490188,2.8028973328725472E-3,null,null,null,null,null,null,null,null,1,1,1,1,1,1,1,1,null,1,2.8028973328725472E-3,null,null,null,{"$f":"CB$149*(H$16+($BW392*MMULT($AD392:$AH392,CC$3:CC$7)))","v":-2.9897161357825555},-0.32642158753880146,-1.8288529604955659,0,-0.13261749700387263,5.0301713553709444E-2,0.72150094749564142,0.16059767404285341,0,0.87580002418168479,1.8082003592738891,2.7818661408688623E-2,0.39901604033823512,8.8816304686137715E-2,0,0.4843489935669385,17.680656052135841,253.60189927406228,56.448817285178187,0,307.83680920680519]
[null,null,null,null,null,null,null,null,null,null,null,null,null,null,null,null,null,null,null,null,null,null,null,null,null,null,null,null,129,-1.4036789878398572,1.4036789878398572,2.9834838466900219E-2,-2.9834838466900219E-2,-1.4804186264827487E-2,-0.20993929382934395,129,0,1,0,0,1,1,2.5000000000000001E-3,null,1,0.96076452152366554,6.9271018577098987E-6,3.9228551274476706E-2,1,0,0,null,null,null,null,1.1211589331490188,2.8028973328725472E-3,null,null,null,null,null,null,null,null,1,1,1,1,1,1,1,1,null,1,2.8028973328725472E-3,null,null,null,{"$f":"CB$149*(H$16+($BW393*MMULT($AD393:$AH393,CC$3:CC$7)))","v":-2.8991282665246789},-0.41700945679667845,-1.7439488059936441,0,-0.20993929382934395,5.5071206551928792E-2,0.65901468774674232,0.17482867125840065,0,0.81063345492938266,1.6995480204864544,3.2403442496532694E-2,0.38775879222177867,0.10286774433614426,0,0.47697002094554442,20.594597032171283,246.44715055640989,65.379465235460756,0,303.14696899413963]
[null,null,null,null,null,null,null,null,null,null,null,null,null,null,null,null,null,null,null,null,null,null,null,null,null,null,null,null,130,-1.4929875810808253,1.4929875810808253,3.2718381068283023E-2,-3.2718381068283023E-2,-1.4804186264827487E-2,-0.13123824347124843,130,0,1,0,0,1,1,2.5000000000000001E-3,null,1,0.99090799599628399,2.264426553980402E-6,9.0897394771620055E-3,1,0,0,null,null,null,null,1.1211589331490188,2.8028973328725472E-3,null,null,null,null,null,null,null,null,1,1,1,1,1,1,1,1,null,1,2.8028973328725472E-3,null,null,null,{"$f":"CB$149*(H$16+($BW394*MMULT($AD394:$AH394,CC$3:CC$7)))","v":-2.9913204023670295},-0.32481732095432769,-1.8303738566332295,0,-0.13123824347124843,5.0221080890950183E-2,0.72265935630620093,0.16035360730780762,0,0.87700880787687407,1.8102428523818328,2.7742731216903651E-2,0.3992057504082171,8.8581268030873239E-2,0,0.48447025034400604,17.63239723819796,253.72247295831332,56.299435465531118,0,307.91387615613917]
[null,null,null,null,null,null,null,null,null,null,null,null,null,null,null,null,null,null,null,null,null,null,null,null,null,null,null,null,136,-1.3817044985397655,1.3817044985397655,2.1605495768024063E-2,-2.1605495768024063E-2,-1.4804186264827487E-2,-0.22735977792364384,136,0,1,0,0,1,1,2.5000000000000001E-3,null,1,0.78041254143919192,1.5377038461178473E-3,0.21804975461469028,1,0,0,null,null,null,null,1.1211589331490188,2.8028973328725472E-3,null,null,null,null,null,null,null,null,1,1,1,1,1,1,1,1,null,1,2.8028973328725472E-3,null,null,null,{"$f":"CB$149*(H$16+($BW395*MMULT($AD395:$AH395,CC$3:CC$7)))","v":-2.8689244345257108},-0.44721328879564637,-1.7302036593924286,0,-0.22735977792364384,5.6759942795290633E-2,0.63940751527090878,0.17724830801103256,0,0.79663411935636841,1.6700498854336003,3.3986974455289323E-2,0.38286731483167485,0.1061335410139638,0,0.47701216969907206,21.601039560049216,243.3382831651769,67.455101692170373,0,303.17375740078512]
[null,null,null,null,null,null,null,null,null,null,null,null,null,null,null,null,null,null,null,null,null,null,null,null,null,null,null,null,139,-1.4956791531273486,1.4956791531273486,3.2748143749076454E-2,-3.2748143749076454E-2,-1.4804186264827487E-2,-0.1288515883635788,139,0,1,0,0,1,1,2.5000000000000001E-3,null,1,0.97971651288560413,1.1457794264331569E-5,2.027202922013158E-2,1,0,0,null,null,null,null,1.1211589331490188,2.8028973328725472E-3,null,null,null,null,null,null,null,null,1,1,1,1,1,1,1,1,null,1,2.8028973328725472E-3,null,null,null,{"$f":"CB$149*(H$16+($BW396*MMULT($AD396:$AH396,CC$3:CC$7)))","v":-2.9940417370943462},-0.32209598622701097,-1.8330356659989593,0,-0.1288515883635788,5.0084598311099023E-2,0.72462863262323574,0.15992734414137247,0,0.87910442519080667,1.8137450002665139,2.7613913920501245E-2,0.39952067821924137,8.8175208818148387E-2,0,0.48469019904210903,17.55052506333675,253.92263105457002,56.041357149989061,0,308.05366855028575]
[null,null,null,null,null,null,null,null,null,null,null,null,null,null,null,null,null,null,null,null,null,null,null,null,null,null,null,null,143,-1.4119341876137217,1.4119341876137217,3.004046758998535E-2,-3.004046758998535E-2,-1.4804186264827487E-2,-0.20264885130499549,143,0,1,0,0,1,1,2.5000000000000001E-3,null,1,0.94220559008622606,1.5368027736987606E-5,5.7779041786036989E-2,1,0,0,null,null,null,null,1.1211589331490188,2.8028973328725472E-3,null,null,null,null,null,null,null,null,1,1,1,1,1,1,1,1,null,1,2.8028973328725472E-3,null,null,null,{"$f":"CB$149*(H$16+($BW397*MMULT($AD397:$AH397,CC$3:CC$7)))","v":-2.9075890954216281},-0.40854862789972901,-1.7519983766444236,0,-0.20264885130499549,5.4607224102073602E-2,0.6646141529153019,0.17342702441334701,0,0.81656492679649817,1.7092133282272206,3.1948746947059958E-2,0.38884213101979098,0.10146599113711793,0,0.47774313089603121,20.305607008512077,247.13568622655569,64.488555503397762,0,303.63833307971612]
[null,null,null,null,null,null,null,null,null,null,null,null,null,null,null,null,null,null,null,null,null,null,null,null,null,null,null,null,145,-1.4929875810808253,1.4929875810808253,3.2718381068283023E-2,-3.2718381068283023E-2,-1.4804186264827487E-2,-0.13123824347124843,145,0,1,0,0,1,1,2.5000000000000001E-3,null,1,0.99090799599628399,2.2644265539804118E-6,9.0897394771620142E-3,1,0,0,null,null,null,null,1.1211589331490188,2.8028973328725472E-3,null,null,null,null,null,null,null,null,1,1,1,1,1,1,1,1,null,1,2.8028973328725472E-3,null,null,null,{"$f":"CB$149*(H$16+($BW398*MMULT($AD398:$AH398,CC$3:CC$7)))","v":-2.9913204023670295},-0.32481732095432769,-1.8303738566332295,0,-0.13123824347124843,5.0221080890950183E-2,0.72265935630620093,0.16035360730780762,0,0.87700880787687407,1.8102428523818328,2.7742731216903651E-2,0.3992057504082171,8.8581268030873239E-2,0,0.48447025034400604,17.63239723819796,253.72247295831332,56.299435465531118,0,307.91387615613917]
[null,null,null,null,null,null,null,null,null,null,null,null,null,null,null,null,null,null,null,null,null,null,null,null,null,null,null,null,152,-1.4975081484025503,1.4975081484025503,3.2877364447216284E-2,-3.2877364447216284E-2,-1.4804186264827487E-2,-0.12725796965620292,152,0,1,0,0,1,1,2.5000000000000001E-3,null,1,0.9969852892011134,4.2665368175158363E-8,3.0146680335184054E-3,1,0,0,null,null,null,null,1.1211589331490188,2.8028973328725472E-3,null,null,null,null,null,null,null,null,1,1,1,1,1,1,1,1,null,1,2.8028973328725472E-3,null,null,null,{"$f":"CB$149*(H$16+($BW399*MMULT($AD399:$AH399,CC$3:CC$7)))","v":-2.9959999530676877},-0.32013777025366941,-1.8347354405760212,0,-0.12725796965620292,4.9986617815463395E-2,0.72604900222772273,0.15965573461050692,0,0.88050649933759439,1.8161978539912875,2.7522671996122284E-2,0.39976316491738662,8.7906575960128186E-2,0,0.48480758712636285,17.492534599353622,254.07674788442526,55.870622652840538,0,308.12827668156211]
[null,null,null,null,null,null,null,null,null,null,null,null,null,null,null,null,null,null,null,null,null,null,null,null,null,null,null,null,174,-1.4916292033461263,1.4916292033461263,3.2499406365139795E-2,-3.2499406365139795E-2,-1.4804186264827487E-2,-0.13239001069655867,174,0,1,0,0,1,1,2.5000000000000001E-3,null,1,0.97653016848910068,3.6890750710587824E-5,2.3432940660188768E-2,1,0,0,null,null,null,null,1.1211589331490188,2.8028973328725472E-3,null,null,null,null,null,null,null,null,1,1,1,1,1,1,1,1,null,1,2.8028973328725472E-3,null,null,null,{"$f":"CB$149*(H$16+($BW400*MMULT($AD400:$AH400,CC$3:CC$7)))","v":-2.9897430499291873},-0.32639467339216988,-1.8292344536016736,0,-0.13239001069655867,5.0300359744233428E-2,0.72152036633925687,0.16053641882231423,0,0.87599927935818422,1.8083564242639887,2.7815511958438149E-2,0.39899234280261964,8.8774766228761265E-2,0,0.48441737901018095,17.678654361766423,253.58683787443761,56.422416763347904,0,307.88027281862963]
[null,null,null,null,null,null,null,null,null,null,null,null,null,null,null,null,null,null,null,null,null,null,null,null,null,null,null,null,196,-1.4929875810808253,1.4929875810808253,3.2718381068283023E-2,-3.2718381068283023E-2,-1.4804186264827487E-2,-0.13123824347124849,196,0,1,0,0,1,1,2.5000000000000001E-3,null,1,0.99090799599628399,2.2644265539803999E-6,9.0897394771619986E-3,1,0,0,null,null,null,null,1.1211589331490188,2.8028973328725472E-3,null,null,null,null,null,null,null,null,1,1,1,1,1,1,1,1,null,1,2.8028973328725472E-3,null,null,null,{"$f":"CB$149*(H$16+($BW401*MMULT($AD401:$AH401,CC$3:CC$7)))","v":-2.9913204023670295},-0.32481732095432769,-1.8303738566332295,0,-0.13123824347124849,5.0221080890950183E-2,0.72265935630620093,0.16035360730780762,0,0.87700880787687407,1.8102428523818328,2.7742731216903651E-2,0.3992057504082171,8.8581268030873239E-2,0,0.48447025034400604,17.63239723819796,253.72247295831332,56.299435465531118,0,307.91387615613917]
[null,null,null,null,null,null,null,null,null,null,null,null,null,null,null,null,null,null,null,null,null,null,null,null,null,null,null,null,208,-1.4954257156933541,1.4954257156933541,3.280874679208598E-2,-3.280874679208598E-2,-1.4804186264827487E-2,-0.12909270631703695,208,0,1,0,0,1,1,2.5000000000000001E-3,null,1,0.99476063313414098,3.1108166650792718E-7,5.239055684192472E-3,1,0,0,null,null,null,null,1.1211589331490188,2.8028973328725472E-3,null,null,null,null,null,null,null,null,1,1,1,1,1,1,1,1,null,1,2.8028973328725472E-3,null,null,null,{"$f":"CB$149*(H$16+($BW402*MMULT($AD402:$AH402,CC$3:CC$7)))","v":-2.9938489027033612},-0.32228882061799591,-1.8327216255219554,0,-0.12909270631703695,5.0094257275372381E-2,0.72448891277400262,0.15997757568776916,0,0.87889248288350319,1.8134532286206473,2.762368308416489E-2,0.39950791194381391,8.8217094967181289E-2,0,0.48465131000483991,17.556734032924336,253.91451721610801,56.067978653573263,0,308.02895191557593]
[null,null,null,null,null,null,null,null,null,null,null,null,null,null,null,null,null,null,null,null,null,null,null,null,null,null,null,null,212,-0.15608698233928608,0.15608698233928608,-0.83505026099556867,0.83505026099556867,-1.4804186264827485E-2,-1.0961758301587352,212,0,1,0,0,1,1,2.5000000000000001E-3,null,3,3.981471552262853E-3,0.21750351959050729,0.7785150087572299,0,0,1,null,null,null,null,1.1211589331490188,2.8028973328725472E-3,null,null,null,null,null,null,null,null,1,1,1,1,1,1,1,1,null,1,2.8028973328725472E-3,null,null,null,{"$f":"CB$149*(H$16+($BW403*MMULT($AD403:$AH403,CC$3:CC$7)))","v":-0.78665116156163839},-2.5294865617597182,-1.3612418999555418,0,-1.0961758301587352,0.45536719589191338,7.9699930774702152E-2,0.25634222779010585,0,0.33414647636216038,1.1255558308188818,0.40457095367771995,7.080939798136679E-2,0.2277472345406516,0,0.29687241380026169,257.13242544539622,45.004200330657305,144.74889577112091,0,188.68266027100717]
[null,null,null,null,null,null,null,null,null,null,null,null,null,null,null,null,null,null,null,null,null,null,null,null,null,null,null,null,216,-1.3764996342460567,1.3764996342460567,2.5541623094613303E-2,-2.5541623094613303E-2,-1.4804186264827487E-2,-0.23300743881077873,216,0,1,0,0,1,1,2.5000000000000001E-3,null,1,0.84252751805488191,7.3382873246741903E-4,0.1567386531126507,1,0,0,null,null,null,null,1.1211589331490188,2.8028973328725472E-3,null,null,null,null,null,null,null,null,1,1,1,1,1,1,1,1,null,1,2.8028973328725472E-3,null,null,null,{"$f":"CB$149*(H$16+($BW404*MMULT($AD404:$AH404,CC$3:CC$7)))","v":-2.8676556975585914},-0.44848202576276597,-1.7210626677721306,0,-0.23300743881077873,5.683200193534791E-2,0.63859678972671619,0.17887596115759272,0,0.7921476808656901,1.6664524336853468,3.4103584828799688E-2,0.38320733122544892,0.10733937407502829,0,0.47534970987072317,21.675153403122341,243.55438676635623,68.221490818367386,0,302.11715083033562]
[null,null,null,null,null,null,null,null,null,null,null,null,null,null,null,null,null,null,null,null,null,null,null,null,null,null,null,null,218,-1.3253858362828013,1.3253858362828013,-1.459983346223173E-2,1.459983346223173E-2,-1.4804186264827487E-2,-0.26809964006378201,218,0,1,0,0,1,1,2.5000000000000001E-3,null,1,0.66620182670434103,9.5923133899958428E-3,0.32420585980566308,1,0,0,null,null,null,null,1.1211589331490188,2.8028973328725472E-3,null,null,null,null,null,null,null,null,1,1,1,1,1,1,1,1,null,1,2.8028973328725472E-3,null,null,null,{"$f":"CB$149*(H$16+($BW405*MMULT($AD405:$AH405,CC$3:CC$7)))","v":-2.776400443038491},-0.53973728028286638,-1.7100903263657201,0,-0.26809964006378201,6.2262220911724009E-2,0.58290137194289771,0.18084945640519831,0,0.7648315694396981,1.5908446186995182,3.9137839220666347E-2,0.36640999698600812,0.11368140815225494,0,0.48077075564107052,24.874765313771224,232.87853558440256,72.25228588585928,0,305.56259503414844]
[null,null,null,null,null,null,null,null,null,null,null,null,null,null,null,null,null,null,null,null,null,null,null,null,null,null,null,null,220,-1.4883069722551652,1.4883069722551652,3.2543606784818623E-2,-3.2543606784818623E-2,-1.4804186264827487E-2,-0.13535680363905372,220,0,1,0,0,1,1,2.5000000000000001E-3,null,1,0.98946668993860032,7.3039420876386607E-6,1.0526006019312096E-2,1,0,0,null,null,null,null,1.1211589331490188,2.8028973328725472E-3,null,null,null,null,null,null,null,null,1,1,1,1,1,1,1,1,null,1,2.8028973328725472E-3,null,null,null,{"$f":"CB$149*(H$16+($BW406*MMULT($AD406:$AH406,CC$3:CC$7)))","v":-2.986465019257905},-0.32967270406345217,-1.8258680220910337,0,-0.13535680363905372,5.0465516412673231E-2,0.71915907275926816,0.16107776437135074,0,0.87340422228050918,1.8041065758238013,2.7972580494380929E-2,0.39862338644316603,8.928395169658894E-2,0,0.4841200813658641,17.778482125576417,253.3523409518894,56.746038845343385,0,307.69131989537237]
[null,null,null,null,null,null,null,null,null,null,null,null,null,null,null,null,null,null,null,null,null,null,null,null,null,null,null,null,223,-2.8038416562862531E-2,2.8038416562862531E-2,-1.1708812270058222,1.1708812270058222,-1.4804186264827487E-2,-1.1232663882799319,223,0,1,0,0,1,1,2.5000000000000001E-3,null,2,4.9009884746869254E-3,0.62010569851517616,0.37499331291013693,0,1,0,null,null,null,null,1.1211589331490188,2.8028973328725472E-3,null,null,null,null,null,null,null,null,1,1,1,1,1,1,1,1,null,1,2.8028973328725472E-3,null,null,null,{"$f":"CB$149*(H$16+($BW407*MMULT($AD407:$AH407,CC$3:CC$7)))","v":-0.32277162977496143},-2.9933660935463955,-1.5690243001893718,0,-1.1232663882799319,0.72413920732008619,5.0118449081039046E-2,0.20824827106274266,0,0.32521577681957192,1.3077217042834399,0.55374106352151964,3.8325011290151541E-2,0.159245098082127,0,0.24868882710620177,351.94020094043844,24.358157743842895,101.21111745151545,0,158.05870568238475]
[null,null,null,null,null,null,null,null,null,null,null,null,null,null,null,null,null,null,null,null,null,null,null,null,null,null,null,null,234,-1.0700414071313966,1.0700414071313966,1.9228299046355108E-2,-1.9228299046355108E-2,-1.4804186264827487E-2,-0.50399223911407187,234,0,1,0,0,1,1,2.5000000000000001E-3,null,1,0.93503688485052272,1.2866669552070496E-6,6.4961828382522027E-2,1,0,0,null,null,null,null,1.1211589331490188,2.8028973328725472E-3,null,null,null,null,null,null,null,null,1,1,1,1,1,1,1,1,null,1,2.8028973328725472E-3,null,null,null,{"$f":"CB$149*(H$16+($BW408*MMULT($AD408:$AH408,CC$3:CC$7)))","v":-2.5548841463956729},-0.76125357692568429,-1.4209177647057287,0,-0.50399223911407187,7.7701233513830528E-2,0.46708053847299263,0.24149228206921172,0,0.60411407129806638,1.3903881253541013,5.5884563523614483E-2,0.33593536218819298,0.17368695666018361,0,0.43449311762800896,35.518450430406325,213.50982735438211,110.3899032500462,0,276.15000078334691]
[null,null,null,null,null,null,null,null,null,null,null,null,null,null,null,null,null,null,null,null,null,null,null,null,null,null,null,null,243,-1.4956791531273483,1.4956791531273483,3.2748143749076447E-2,-3.2748143749076447E-2,-1.4804186264827487E-2,-0.12885158836357882,243,0,1,0,0,1,1,2.5000000000000001E-3,null,1,0.97971651288560413,1.1457794264331569E-5,2.027202922013158E-2,1,0,0,null,null,null,null,1.1211589331490188,2.8028973328725472E-3,null,null,null,null,null,null,null,null,1,1,1,1,1,1,1,1,null,1,2.8028973328725472E-3,null,null,null,{"$f":"CB$149*(H$16+($BW409*MMULT($AD409:$AH409,CC$3:CC$7)))","v":-2.9940417370943457},-0.32209598622701119,-1.8330356659989591,0,-0.12885158836357882,5.0084598311099043E-2,0.72462863262323562,0.1599273441413725,0,0.87910442519080667,1.8137450002665139,2.7613913920501255E-2,0.39952067821924131,8.8175208818148401E-2,0,0.48469019904210903,17.550525063336757,253.92263105456996,56.041357149989068,0,308.05366855028575]
[null,null,null,null,null,null,null,null,null,null,null,null,null,null,null,null,null,null,null,null,null,null,null,null,null,null,null,null,247,-1.4985688599295939,1.4985688599295939,3.2910686199216374E-2,-3.2910686199216374E-2,-1.4804186264827487E-2,-0.12632300377512864,247,0,1,0,0,1,1,2.5000000000000001E-3,null,1,0.99547903155286566,9.6373294809475725E-8,4.5208719738395256E-3,{"$f":"IF($AS410= 1,1,0)","v":1},{"$f":"IF($AS410= 2,1,0)","v":0},{"$f":"IF($AS410= 3,1,0)","v":0},null,null,null,null,1.1211589331490188,{"$f":"AQ410*BD410","v":2.8028973328725472E-3},null,null,null,null,null,null,null,null,{"$f":"INDEX(AK$148:AK$149,2-AK410)","v":1},{"$f":"INDEX(AL$148:AL$149,2-AL410)","v":1},{"$f":"INDEX(AM$148:AM$149,2-AM410)","v":1},{"$f":"INDEX(AN$148:AN$149,2-AN410)","v":1},{"$f":"INDEX(AO$148:AO$149,2-AO410)","v":1},{"$f":"INDEX(AW$148:AW$149,2-AW410)","v":1},{"$f":"INDEX(AX$148:AX$149,2-AX410)","v":1},{"$f":"INDEX(AY$148:AY$149,2-AY410)","v":1},null,1,2.8028973328725472E-3,null,null,null,{"$f":"CB$149*(H$16+($BW410*MMULT($AD410:$AH410,CC$3:CC$7)))","v":-2.9970939863467314},-0.31904373697462574,-1.8357628303510647,0,-0.12632300377512864,{"$f":"$BW410*IF(CB$149=0,0,IF(ABS(CB410)>OverflowTrigger,OverflowTrigger,EXP(CB410)))","v":4.9931960695871955E-2},{"$f":"$BW410*IF(CC$149=0,0,IF(ABS(CC410)>OverflowTrigger,OverflowTrigger,EXP(CC410)))","v":0.72684375866410045},{"$f":"$BW410*IF(CD$149=0,0,IF(ABS(CD410)>OverflowTrigger,OverflowTrigger,EXP(CD410)))","v":0.15949179017308107},{"$f":"$BW410*IF(CE$149=0,0,IF(ABS(CE410)>OverflowTrigger,OverflowTrigger,EXP(CE410)))","v":0},{"$f":"IF(L$12=\"\",0,$BW410*IF($CG$149=0,0,IF(ABS(CF410)>OverflowTrigger,OverflowTrigger,EXP(CF410))))","v":0.88133012784481701},1.8175976373778706,2.7471404929809182E-2,{"$f":"IF($CL410=0,0,CH410/$CL410)","v":0.39989255251930811},{"$f":"IF($CL410=0,0,CI410/$CL410)","v":8.7748678196550398E-2},{"$f":"IF($CL410=0,0,CJ410/$CL410)","v":0},{"$f":"IF($CL410=0,0,CK410/$CL410)","v":0.48488736435433227},{"$f":"CM410*$BX410*TargetMarketSize","v":17.459950883229851},{"$f":"CN410*$BX410*TargetMarketSize","v":254.15898252732831},{"$f":"CO410*$BX410*TargetMarketSize","v":55.770267858330243},{"$f":"CP410*$BX410*TargetMarketSize","v":0},{"$f":"CQ410*$BX410*TargetMarketSize","v":308.1789805492931}]
[null,null,null,null,null,null,null,null,null,null,null,null,null,null,null,null,null,null,null,null,null,null,null,null,null,null,null,null,256,-0.96902566365655762,0.96902566365655762,1.2888972662621236E-2,-1.2888972662621236E-2,-1.4804186264827487E-2,-0.59221427347569267,256,0,1,0,0,1,1,{"$f":"AP411/$AP$554","v":2.5000000000000001E-3},null,1,0.64409947499571474,7.8241186960909892E-4,0.35511811303467616,1,0,0,null,null,null,null,1.1211589331490188,2.8028973328725472E-3,null,null,null,null,null,null,null,null,1,1,1,1,1,1,1,1,null,{"$f":"IF(AND(BN411:BU411),1,0)","v":1},{"$f":"BE411*BW411","v":2.8028973328725472E-3},null,null,null,{"$f":"CB$149*(H$16+($BW411*MMULT($AD411:$AH411,CC$3:CC$7)))","v":-2.4475290765371001},-0.86860864678425709,-1.3262413476146235,0,{"$f":"IF($CG$149=0,0,$L$16+$AI411)","v":-0.59221427347569267},8.650707499519579E-2,0.41953486453762584,0.26547320992871215,0,0.55310121046388916,{"$f":"IF($CG$149=0,0,SUM(CG411:CK411))","v":1.324616359925423},{"$f":"IF($CL411=0,0,CG411/$CL411)","v":6.5307267532213026E-2},0.31672178996886768,0.20041516771215065,0,0.41755577478676859,41.507221284962192,201.29829219271321,127.37750375159753,0,265.38516458890865]
[null,null,null,null,null,null,null,null,null,null,null,null,null,null,null,null,null,null,null,null,null,null,null,null,null,null,null,null,265,-1.3965188806884239,1.3965188806884239,2.9045168504388801E-2,-2.9045168504388801E-2,-1.4804186264827487E-2,-0.21610458735558966,265,0,1,0,0,1,1,2.5000000000000001E-3,null,1,0.90340087099539923,1.0767677593490771E-4,9.6491452128665847E-2,1,0,0,null,null,null,null,1.1211589331490188,2.8028973328725472E-3,null,null,null,null,null,null,null,null,1,1,1,1,1,1,1,1,null,1,2.8028973328725472E-3,null,null,null,{"$f":"CB$149*(H$16+($BW412*MMULT($AD412:$AH412,CC$3:CC$7)))","v":-2.8911784894107342},-0.42495923391062318,-1.7375783688047222,0,-0.21610458735558966,5.5510755211433935E-2,0.65379643731058867,0.17594596136215876,0,0.80565103655557169,1.690904190439753,3.2829036396791508E-2,0.38665492758673453,0.10405436473393595,0,0.47646167128253802,20.865090973551688,245.74556931734153,66.133643404193577,0,302.8238781230948]
[null,null,null,null,null,null,null,null,null,null,null,null,null,null,null,null,null,null,null,null,null,null,null,null,null,null,null,null,267,-1.3874791968650637,1.3874791968650637,2.9087672888845239E-2,-2.9087672888845239E-2,-1.4804186264827487E-2,-0.22415703223839858,267,0,1,0,0,1,1,2.5000000000000001E-3,null,1,0.93355953804013359,4.9186476875348332E-5,6.6391275382991069E-2,1,0,0,null,null,null,null,1.1211589331490188,2.8028973328725472E-3,null,null,null,null,null,null,null,null,1,1,1,1,1,1,1,1,null,1,2.8028973328725472E-3,null,null,null,{"$f":"CB$149*(H$16+($BW413*MMULT($AD413:$AH413,CC$3:CC$7)))","v":-2.8821813099718301},-0.43395641334952706,-1.7284961805969057,0,-0.22415703223839858,5.6012448966925026E-2,0.64794049642582707,0.17755121426791587,0,0.79918962597931886,1.6806937856399868,3.3326980468126259E-2,0.38551965977496583,0.10564162001723985,0,0.47551173973966804,21.181568381617055,245.02402921833897,67.142452358684352,0,302.22013185954114]
[null,null,null,null,null,null,null,null,null,null,null,null,null,null,null,null,null,null,null,null,null,null,null,null,null,null,null,null,278,-1.4883069722551652,1.4883069722551652,3.2543606784818623E-2,-3.2543606784818623E-2,-1.4804186264827487E-2,-0.13535680363905375,278,0,1,0,0,1,1,2.5000000000000001E-3,null,1,0.98946668993860021,7.3039420876386607E-6,1.0526006019312117E-2,1,0,0,null,null,null,null,1.1211589331490188,2.8028973328725472E-3,null,null,null,null,null,null,null,null,1,1,1,1,1,1,1,1,null,1,2.8028973328725472E-3,null,null,null,{"$f":"CB$149*(H$16+($BW414*MMULT($AD414:$AH414,CC$3:CC$7)))","v":-2.986465019257905},-0.32967270406345217,-1.8258680220910337,0,-0.13535680363905375,5.0465516412673231E-2,0.71915907275926816,0.16107776437135074,0,0.87340422228050918,1.8041065758238013,2.7972580494380929E-2,0.39862338644316603,8.928395169658894E-2,0,0.4841200813658641,17.778482125576417,253.3523409518894,56.746038845343385,0,307.69131989537237]
[null,null,null,null,null,null,null,null,null,null,null,null,null,null,null,null,null,null,null,null,null,null,null,null,null,null,null,null,280,-1.3947655575321563,1.3947655575321563,2.957689260943263E-2,-2.957689260943263E-2,-1.4804186264827487E-2,-0.21780175557071638,280,0,1,0,0,1,1,2.5000000000000001E-3,null,1,0.97353045828038021,3.1027466619946078E-6,2.646643887295777E-2,1,0,0,null,null,null,null,1.1211589331490188,2.8028973328725472E-3,null,null,null,null,null,null,null,null,1,1,1,1,1,1,1,1,null,1,2.8028973328725472E-3,null,null,null,{"$f":"CB$149*(H$16+($BW415*MMULT($AD415:$AH415,CC$3:CC$7)))","v":-2.8899568903595103},-0.42618083296184706,-1.7352933215434108,0,-0.21780175557071638,5.5578608533671831E-2,0.65299824783609062,0.17634846589511072,0,0.80428487085826772,1.6892101931231409,3.2902127136063421E-2,0.38657015597850353,0.10439699370334973,0,0.47613072318208333,20.911545121818481,245.69169118042836,66.351407475322134,0,302.61353804061264]
[null,null,null,null,null,null,null,null,null,null,null,null,null,null,null,null,null,null,null,null,null,null,null,null,null,null,null,null,296,-0.96902566365655673,0.96902566365655673,1.28889726626212E-2,-1.28889726626212E-2,-1.4804186264827487E-2,-0.59221427347569355,296,0,1,0,0,1,1,2.5000000000000001E-3,null,1,0.64409947499571507,7.8241186960909665E-4,0.35511811303467583,1,0,0,null,null,null,null,1.1211589331490188,2.8028973328725472E-3,null,null,null,null,null,null,null,null,1,1,1,1,1,1,1,1,null,1,2.8028973328725472E-3,null,null,null,{"$f":"CB$149*(H$16+($BW416*MMULT($AD416:$AH416,CC$3:CC$7)))","v":-2.4475290765370992},-0.86860864678425798,-1.3262413476146226,0,-0.59221427347569355,8.6507074995195873E-2,0.41953486453762545,0.26547320992871237,0,0.55310121046388872,1.3246163599254224,6.5307267532213123E-2,0.31672178996886752,0.2004151677121509,0,0.41755577478676847,41.507221284962256,201.29829219271312,127.37750375159767,0,265.38516458890854]
[null,null,null,null,null,null,null,null,null,null,null,null,null,null,null,null,null,null,null,null,null,null,null,null,null,null,null,null,305,-4.2014367258119467E-2,4.2014367258119467E-2,-1.1253502222625746,1.1253502222625746,-1.4804186264827487E-2,-1.1226042945326959,305,0,1,0,0,1,1,2.5000000000000001E-3,null,2,1.3499436895340318E-3,0.53889903309092246,0.45975102311954358,0,1,0,null,null,null,null,1.1211589331490188,2.8028973328725472E-3,null,null,null,null,null,null,null,null,1,1,1,1,1,1,1,1,null,1,2.8028973328725472E-3,null,null,null,{"$f":"CB$149*(H$16+($BW417*MMULT($AD417:$AH417,CC$3:CC$7)))","v":-0.38227858521346603},-2.9338591381078913,-1.5374692461413813,0,-1.1226042945326959,0.6823049466569695,5.3191368709073657E-2,0.21492433433107566,0,0.32543117144975703,1.2758518211468759,0.53478384820867264,4.1690867095568671E-2,0.16845556103676526,0,0.25506972365899333,339.89159807171649,26.497388598354032,107.06499464529861,0,162.11420050281239]
[null,null,null,null,null,null,null,null,null,null,null,null,null,null,null,null,null,null,null,null,null,null,null,null,null,null,null,null,307,-0.33739548300301159,0.33739548300301159,-0.52276248788914681,0.52276248788914681,-1.4804186264827487E-2,-1.0156203710487219,307,0,1,0,0,1,1,2.5000000000000001E-3,null,3,3.4976015311049428E-2,8.2873219879459933E-2,0.88215076470949061,0,0,1,null,null,null,null,1.1211589331490188,2.8028973328725472E-3,null,null,null,null,null,null,null,null,1,1,1,1,1,1,1,1,null,1,2.8028973328725472E-3,null,null,null,{"$f":"CB$149*(H$16+($BW418*MMULT($AD418:$AH418,CC$3:CC$7)))","v":-1.2802474353317859},-2.0358902879895711,-1.2302626275128454,0,-1.0156203710487219,0.27796851271211737,0.13056419101411992,0.29221582368745624,0,0.36217767557975977,1.0629262029934532,0.26151252262790387,0.12283467153826869,0.2749163797679528,0,0.34073642606587479,166.20903852930292,78.069808853810969,174.72810364115449,0,216.5612307939133]
[null,null,null,null,null,null,null,null,null,null,null,null,null,null,null,null,null,null,null,null,null,null,null,null,null,null,null,null,320,-0.5993190052708639,0.5993190052708639,-2.1590070903462857E-3,2.1590070903462857E-3,-1.4804186264827487E-2,-0.91720510177142356,320,0,1,0,0,1,1,2.5000000000000001E-3,null,3,0.21301863491141926,1.8469180913097975E-3,0.78513444689727097,0,0,1,null,null,null,null,1.1211589331490188,2.8028973328725472E-3,null,null,null,null,null,null,null,null,1,1,1,1,1,1,1,1,null,1,2.8028973328725472E-3,null,null,null,{"$f":"CB$149*(H$16+($BW419*MMULT($AD419:$AH419,CC$3:CC$7)))","v":-2.0627744383984385},-1.2533632849229184,-0.97158266898189738,0,-0.91720510177142356,0.12710084679237249,0.28554281820751559,0.37848354965844783,0,0.39963441920460074,1.1907616338629365,0.10673911820625766,0.23979847022883102,0.31784997004867682,0,0.33561244151623459,67.839987287227146,152.40827772611945,202.01532755480099,0,213.30458925003401]
[null,null,null,null,null,null,null,null,null,null,null,null,null,null,null,null,null,null,null,null,null,null,null,null,null,null,null,null,324,-3.2999606486557536E-4,3.2999606486557536E-4,-1.232139675610314,1.232139675610314,-1.4804186264827487E-2,-1.1320787043564693,324,0,1,0,0,1,1,2.5000000000000001E-3,null,2,8.9745089274148311E-6,0.97907573999342179,2.0915285397650751E-2,0,1,0,null,null,null,null,1.1211589331490188,2.8028973328725472E-3,null,null,null,null,null,null,null,null,1,1,1,1,1,1,1,1,null,1,2.8028973328725472E-3,null,null,null,{"$f":"CB$149*(H$16+($BW420*MMULT($AD420:$AH420,CC$3:CC$7)))","v":-0.23380476067247269},-3.0823329626488842,-1.6025743282958667,0,-1.1320787043564693,0.79151633592805293,4.5852160394267143E-2,0.20137743850272555,0,0.32236246321676493,1.3611083980418106,0.58152336512417802,3.3687368662358851E-2,0.14795106605208061,0,0.23683820016138243,369.59774785676433,21.410619650974201,94.032990048782565,0,150.52682426166038]
[null,null,null,null,null,null,null,null,null,null,null,null,null,null,null,null,null,null,null,null,null,null,null,null,null,null,null,null,333,-7.2354747557555662E-3,7.2354747557555662E-3,-1.2139717908932623,1.2139717908932623,-1.4804186264827487E-2,-1.1306324826488741,333,0,1,0,0,1,1,2.5000000000000001E-3,null,2,4.0342394159186438E-5,0.83998213977390535,0.15997751773193541,0,1,0,null,null,null,null,1.1211589331490188,2.8028973328725472E-3,null,null,null,null,null,null,null,null,1,1,1,1,1,1,1,1,null,1,2.8028973328725472E-3,null,null,null,{"$f":"CB$149*(H$16+($BW421*MMULT($AD421:$AH421,CC$3:CC$7)))","v":-0.25887812408041433},-3.0572595992409428,-1.591311922269705,0,-1.1306324826488741,0.77191709541685638,4.7016362515014176E-2,0.20365825259836515,0,0.32282900809112819,1.345420718621364,0.5737365901484186,3.4945472345030676E-2,0.15137142588903435,0,0.23994651161751626,364.64872144319361,22.210230321108693,96.206861931519171,0,152.50236812236]
[null,null,null,null,null,null,null,null,null,null,null,null,null,null,null,null,null,null,null,null,null,null,null,null,null,null,null,null,340,-2.8038416562862489E-2,2.8038416562862489E-2,-1.1708812270058222,1.1708812270058222,-1.4804186264827487E-2,-1.1232663882799319,340,0,1,0,0,1,1,2.5000000000000001E-3,null,2,4.9009884746869289E-3,0.62010569851517661,0.37499331291013649,0,1,0,null,null,null,null,1.1211589331490188,2.8028973328725472E-3,null,null,null,null,null,null,null,null,1,1,1,1,1,1,1,1,null,1,2.8028973328725472E-3,null,null,null,{"$f":"CB$149*(H$16+($BW422*MMULT($AD422:$AH422,CC$3:CC$7)))","v":-0.32277162977496143},-2.9933660935463955,-1.5690243001893718,0,-1.1232663882799319,0.72413920732008619,5.0118449081039046E-2,0.20824827106274266,0,0.32521577681957192,1.3077217042834399,0.55374106352151964,3.8325011290151541E-2,0.159245098082127,0,0.24868882710620177,351.94020094043844,24.358157743842895,101.21111745151545,0,158.05870568238475]
[null,null,null,null,null,null,null,null,null,null,null,null,null,null,null,null,null,null,null,null,null,null,null,null,null,null,null,null,356,-0.41163567665136358,0.41163567665136358,-0.18594321271631445,0.18594321271631445,-1.4804186264827487E-2,-1.036651771356919,356,0,1,0,0,1,1,2.5000000000000001E-3,null,3,1.2649787924844681E-2,4.1802186101988568E-2,0.94554802587316678,0,0,1,null,null,null,null,1.1211589331490188,2.8028973328725472E-3,null,null,null,null,null,null,null,null,1,1,1,1,1,1,1,1,null,1,2.8028973328725472E-3,null,null,null,{"$f":"CB$149*(H$16+($BW423*MMULT($AD423:$AH423,CC$3:CC$7)))","v":-1.6913069041529702},-1.6248308191683869,-0.96768354598836515,0,-1.036651771356919,0.18427853217168591,0.19694499170333649,0.37996218438560037,0,0.35464011248771909,1.1158258207483418,0.16514990847594593,0.17650155431181275,0.34052105384223341,0,0.31782748337000799,104.96402705749604,112.17877196204184,216.42434706131939,0,202.00103573732432]
[null,null,null,null,null,null,null,null,null,null,null,null,null,null,null,null,null,null,null,null,null,null,null,null,null,null,null,null,3,-3.147767532441541E-3,3.147767532441541E-3,-1.2246812779558267,1.2246812779558267,-1.4804186264827487E-2,-1.1315002129610658,3,0,0,1,1,0,1,2.5000000000000001E-3,null,2,2.0534649284100139E-7,0.90025612385341203,9.9743670700095169E-2,0,1,0,null,null,{"$f":"SUM($AQ$424:$AQ$485)","v":0.15500000000000008},{"$f":"Assumptions!S60","v":0.30207184878767296},{"$f":"$BC$424/$BB$424","v":1.9488506373398244},4.8721265933495614E-3,null,null,null,null,null,null,null,null,1,1,1,1,1,1,1,1,null,1,4.8721265933495614E-3,null,null,null,{"$f":"CB$149*(H$16+($BW424*MMULT($AD424:$AH424,CC$3:CC$7)))","v":-0.24408092979453611},-3.072056793526821,-1.5979337021089555,0,-1.1315002129610658,0.78342422933530853,4.6325774249346426E-2,0.20231412764838533,0,0.32254900107800855,1.3546131323110489,0.57833798495570554,3.4198527346558316E-2,0.14935196095672396,0,0.23811152674101216,638.93288092783848,37.781650469836407,165.0001922208348,0,263.0594699298768]
[null,null,null,null,null,null,null,null,null,null,null,null,null,null,null,null,null,null,null,null,null,null,null,null,null,null,null,null,11,-3.147767532441541E-3,3.147767532441541E-3,-1.2246812779558267,1.2246812779558267,-1.4804186264827487E-2,-1.1315002129610658,11,0,0,1,1,0,1,2.5000000000000001E-3,null,2,2.0534649284100099E-7,0.9002561238534118,9.9743670700095322E-2,0,1,0,null,null,null,null,1.9488506373398244,4.8721265933495614E-3,null,null,null,null,null,null,null,null,1,1,1,1,1,1,1,1,null,1,4.8721265933495614E-3,null,null,null,{"$f":"CB$149*(H$16+($BW425*MMULT($AD425:$AH425,CC$3:CC$7)))","v":-0.24408092979453611},-3.072056793526821,-1.5979337021089555,0,-1.1315002129610658,0.78342422933530853,4.6325774249346426E-2,0.20231412764838533,0,0.32254900107800855,1.3546131323110489,0.57833798495570554,3.4198527346558316E-2,0.14935196095672396,0,0.23811152674101216,638.93288092783848,37.781650469836407,165.0001922208348,0,263.0594699298768]
[null,null,null,null,null,null,null,null,null,null,null,null,null,null,null,null,null,null,null,null,null,null,null,null,null,null,null,null,12,-7.390176458500014E-3,7.390176458500014E-3,-1.2134855780834066,1.2134855780834066,-1.4804186264827487E-2,-1.130620558425238,12,0,0,1,1,0,1,2.5000000000000001E-3,null,2,4.4221221421516434E-7,0.8569819712293355,0.14301758645845028,0,1,0,null,null,null,null,1.9488506373398244,4.8721265933495614E-3,null,null,null,null,null,null,null,null,1,1,1,1,1,1,1,1,null,1,4.8721265933495614E-3,null,null,null,{"$f":"CB$149*(H$16+($BW426*MMULT($AD426:$AH426,CC$3:CC$7)))","v":-0.25951903859301462},-3.0566186847283427,-1.5909804111625938,0,-1.130620558425238,0.77142252105475229,4.704650564263186E-2,0.2037257787633748,0,0.32283285759936803,1.345027663060127,0.57353654667567033,3.4978095198127335E-2,0.15146586524463743,0,0.24001949288156491,633.62837582414022,38.642896914369814,167.33557912575287,0,265.16734168412353]
[null,null,null,null,null,null,null,null,null,null,null,null,null,null,null,null,null,null,null,null,null,null,null,null,null,null,null,null,13,-4.1307886420794297E-2,4.1307886420794297E-2,-1.1240107268962396,1.1240107268962396,-1.4804186264827487E-2,-1.1235790427814791,13,0,0,1,1,0,1,2.5000000000000001E-3,null,2,1.5400602395877685E-5,0.57221867569222151,0.42776592360538257,0,1,0,null,null,null,null,1.9488506373398244,4.8721265933495614E-3,null,null,null,null,null,null,null,null,1,1,1,1,1,1,1,1,null,1,4.8721265933495614E-3,null,null,null,{"$f":"CB$149*(H$16+($BW427*MMULT($AD427:$AH427,CC$3:CC$7)))","v":-0.38291159974247591},-2.9332261235788812,-1.535423269937721,0,-1.1235790427814791,0.68187317438599859,5.3225050277620853E-2,0.21536451455028127,0,0.32511411253670108,1.2755768517506016,0.53456063697784717,4.1726259146655724E-2,0.16883695737713883,0,0.25487614649835838,590.56879661991286,46.098094298537561,186.52671342749184,0,281.58058920244429]
[null,null,null,null,null,null,null,null,null,null,null,null,null,null,null,null,null,null,null,null,null,null,null,null,null,null,null,null,17,-1.2828544074827648E-4,1.2828544074827648E-4,-1.2326496103545324,1.2326496103545324,-1.4804186264827487E-2,-1.1321263139179172,17,0,0,1,1,0,1,2.5000000000000001E-3,null,2,4.2448077533778037E-9,0.99374505144687753,6.2549442083146755E-3,0,1,0,null,null,null,null,1.9488506373398244,4.8721265933495614E-3,null,null,null,null,null,null,null,null,1,1,1,1,1,1,1,1,null,1,4.8721265933495614E-3,null,null,null,{"$f":"CB$149*(H$16+($BW428*MMULT($AD428:$AH428,CC$3:CC$7)))","v":-0.23309311530413712},-3.0830446080172198,-1.6028825524159678,0,-1.1321263139179172,0.79207981533745331,4.5819541524604768E-2,0.20131537868359273,0,0.32234711604660282,1.3615618515922536,0.5817435428373452,3.3652192495715078E-2,0.14785621266354382,0,0.23674805200339585,642.6952533901092,37.17807382558869,163.34772810648533,0,261.55313822620309]
[null,null,null,null,null,null,null,null,null,null,null,null,null,null,null,null,null,null,null,null,null,null,null,null,null,null,null,null,18,-1.6185149121092915E-3,1.6185149121092915E-3,-1.2287182685955467,1.2287182685955467,-1.4804186264827487E-2,-1.1318169643975788,18,0,0,1,1,0,1,2.5000000000000001E-3,null,2,6.6726215059584551E-7,0.92718324539390118,7.281608724394821E-2,0,1,0,null,null,null,null,1.9488506373398244,4.8721265933495614E-3,null,null,null,null,null,null,null,null,1,1,1,1,1,1,1,1,null,1,4.8721265933495614E-3,null,null,null,{"$f":"CB$149*(H$16+($BW429*MMULT($AD429:$AH429,CC$3:CC$7)))","v":-0.23851468653448382},-3.0776230367868731,-1.6004414401283431,0,-1.1318169643975788,0.78779711816263687,4.6068630048178544E-2,0.20180741243867084,0,0.32244684939777107,1.3581200100472572,0.58006443637865601,3.3920883064358601E-2,0.14859321042744134,0,0.23742147012954415,640.84021990632891,37.474916231875895,164.1619442167422,0,262.29711319343943]
[null,null,null,null,null,null,null,null,null,null,null,null,null,null,null,null,null,null,null,null,null,null,null,null,null,null,null,null,21,-0.52762615183859474,0.52762615183859474,-5.4657974749124108E-2,5.4657974749124108E-2,-1.4804186264827485E-2,-0.96740924607323486,21,0,0,1,1,0,1,2.5000000000000001E-3,null,3,4.1717617880199467E-2,7.650688684662405E-3,0.95063169333513808,0,0,1,null,null,null,null,1.9488506373398244,4.8721265933495614E-3,null,null,null,null,null,null,null,null,1,1,1,1,1,1,1,1,null,1,4.8721265933495614E-3,null,null,null,{"$f":"CB$149*(H$16+($BW430*MMULT($AD430:$AH430,CC$3:CC$7)))","v":-1.9385826173073917},-1.377555106013965,-0.95238878320840603,0,-0.96740924607323486,0.14390777768592825,0.25219438847053044,0.385818285540872,0,0.38006642227609877,1.1619868739734294,0.1238463023199511,0.21703720938615118,0.33203325629794878,0,0.32708323199594902,136.82219876947363,239.77710796957743,366.82177295781105,0,361.35311385152437]
[null,null,null,null,null,null,null,null,null,null,null,null,null,null,null,null,null,null,null,null,null,null,null,null,null,null,null,null,24,-2.9310027917393787E-3,2.9310027917393787E-3,-1.2252529508514276,1.2252529508514276,-1.4804186264827487E-2,-1.1315452539028701,24,0,0,1,1,0,1,2.5000000000000001E-3,null,2,2.1191829932553695E-8,0.94686530000367064,5.3134678704499415E-2,0,1,0,null,null,null,null,1.9488506373398244,4.8721265933495614E-3,null,null,null,null,null,null,null,null,1,1,1,1,1,1,1,1,null,1,4.8721265933495614E-3,null,null,null,{"$f":"CB$149*(H$16+($BW431*MMULT($AD431:$AH431,CC$3:CC$7)))","v":-0.2432924921582329},-3.0728452311631242,-1.598288610263854,0,-1.1315452539028701,0.78404215404844824,4.6289263660449914E-2,0.20224233745484785,0,0.32253447349439246,1.3551082286581384,0.57858268252479439,3.4159089791880821E-2,0.14924441692388896,0,0.23801381075943584,639.20321648739184,37.738080877172052,164.88138034868859,0,262.95151583513399]
[null,null,null,null,null,null,null,null,null,null,null,null,null,null,null,null,null,null,null,null,null,null,null,null,null,null,null,null,25,-8.3310422469705001E-4,8.3310422469705001E-4,-1.2307949988358957,1.2307949988358957,-1.4804186264827487E-2,-1.1319787746243721,25,0,0,1,1,0,1,2.5000000000000001E-3,null,2,2.1508613026385278E-6,0.9472656303717063,5.2732218666991022E-2,0,1,0,null,null,null,null,1.9488506373398244,4.8721265933495614E-3,null,null,null,null,null,null,null,null,1,1,1,1,1,1,1,1,null,1,4.8721265933495614E-3,null,null,null,{"$f":"CB$149*(H$16+($BW432*MMULT($AD432:$AH432,CC$3:CC$7)))","v":-0.23565254560672244},-3.0804851777146345,-1.6017327596812798,0,-1.1319787746243721,0.7900551343761687,4.5936963650407302E-2,0.20154698276621436,0,0.32239467842095387,1.3599337592137444,0.58095118899978249,3.3778824401687106E-2,0.14820352932685502,0,0.23706645727167527,641.81988131821095,37.317973487386425,163.73143459310089,0,261.90490414968809]
[null,null,null,null,null,null,null,null,null,null,null,null,null,null,null,null,null,null,null,null,null,null,null,null,null,null,null,null,27,-3.8166777282414846E-3,3.8166777282414846E-3,-1.2229188629015477,1.2229188629015477,-1.4804186264827487E-2,-1.1313607826313796,27,0,0,1,1,0,1,2.5000000000000001E-3,null,2,1.4558357887255698E-6,0.89421846364682978,0.10578008041738153,0,1,0,null,null,null,null,1.9488506373398244,4.8721265933495614E-3,null,null,null,null,null,null,null,null,1,1,1,1,1,1,1,1,null,1,4.8721265933495614E-3,null,null,null,{"$f":"CB$149*(H$16+($BW433*MMULT($AD433:$AH433,CC$3:CC$7)))","v":-0.24651225504461505},-3.0696254682767421,-1.5968401972504764,0,-1.1313607826313796,0.7815217838939883,4.6438544308802961E-2,0.20253548013285949,0,0.32259397732702261,1.3530897856626733,0.57758309328396817,3.4320371641900882E-2,0.14968369599632156,0,0.23841283907780944,638.09889608997844,37.916260902961959,165.366684531678,0,263.39235202376813]
[null,null,null,null,null,null,null,null,null,null,null,null,null,null,null,null,null,null,null,null,null,null,null,null,null,null,null,null,38,-2.5035509997632904E-4,2.5035509997632904E-4,-1.2323274451064392,1.2323274451064392,-1.4804186264827487E-2,-1.1321010092140966,38,0,0,1,1,0,1,2.5000000000000001E-3,null,2,1.341942430882134E-9,0.99119829963329553,8.8016989247620588E-3,0,1,0,null,null,null,null,1.9488506373398244,4.8721265933495614E-3,null,null,null,null,null,null,null,null,1,1,1,1,1,1,1,1,null,1,4.8721265933495614E-3,null,null,null,{"$f":"CB$149*(H$16+($BW434*MMULT($AD434:$AH434,CC$3:CC$7)))","v":-0.23353735021145838},-3.0826003731098988,-1.6026824568271028,0,-1.1321010092140966,0.79172802397888198,4.5839900686177756E-2,0.20135566503326402,0,0.32235527304810657,1.3612788627464303,0.58160605122564046,3.3674144174760834E-2,0.14791654417304442,0,0.23680326042655428,642.54335620566849,37.202325474103496,163.41438080123942,0,261.61413106737507]
[null,null,null,null,null,null,null,null,null,null,null,null,null,null,null,null,null,null,null,null,null,null,null,null,null,null,null,null,41,-8.331042246970485E-4,8.331042246970485E-4,-1.2307949988358957,1.2307949988358957,-1.4804186264827487E-2,-1.1319787746243721,41,0,0,1,1,0,1,2.5000000000000001E-3,null,2,2.1508613026385278E-6,0.9472656303717063,5.2732218666991022E-2,0,1,0,null,null,null,null,1.9488506373398244,4.8721265933495614E-3,null,null,null,null,null,null,null,null,1,1,1,1,1,1,1,1,null,1,4.8721265933495614E-3,null,null,null,{"$f":"CB$149*(H$16+($BW435*MMULT($AD435:$AH435,CC$3:CC$7)))","v":-0.23565254560672244},-3.0804851777146345,-1.6017327596812798,0,-1.1319787746243721,0.7900551343761687,4.5936963650407302E-2,0.20154698276621436,0,0.32239467842095387,1.3599337592137444,0.58095118899978249,3.3778824401687106E-2,0.14820352932685502,0,0.23706645727167527,641.81988131821095,37.317973487386425,163.73143459310089,0,261.90490414968809]
[null,null,null,null,null,null,null,null,null,null,null,null,null,null,null,null,null,null,null,null,null,null,null,null,null,null,null,null,46,-5.4150827275969755E-5,5.4150827275969755E-5,-1.2328452530552689,1.2328452530552689,-1.4804186264827487E-2,-1.1321416851191131,46,0,0,1,1,0,1,2.5000000000000001E-3,null,2,1.8803303742152777E-9,0.99583860320047879,4.1613948191908598E-3,0,1,0,null,null,null,null,1.9488506373398244,4.8721265933495614E-3,null,null,null,null,null,null,null,null,1,1,1,1,1,1,1,1,null,1,4.8721265933495614E-3,null,null,null,{"$f":"CB$149*(H$16+($BW436*MMULT($AD436:$AH436,CC$3:CC$7)))","v":-0.23282333798992827},-3.0833143853314287,-1.6030040605032321,0,-1.1321416851191131,0.79229352932897124,4.5807182118972563E-2,0.20129091872306359,0,0.32234216122230802,1.3617337913933156,0.58182703134531344,3.3638867162210172E-2,0.14781958118047747,0,0.23671452031199872,642.78748933917041,37.163352341012036,163.30725858932223,0,261.5160932788815]
[null,null,null,null,null,null,null,null,null,null,null,null,null,null,null,null,null,null,null,null,null,null,null,null,null,null,null,null,48,-2.2180333016525416E-2,2.2180333016525416E-2,-1.1745946744739635,1.1745946744739635,-1.4804186264827487E-2,-1.12751759129246,48,0,0,1,1,0,1,2.5000000000000001E-3,null,2,5.55009934401635E-5,0.65360500017724643,0.34633949872931347,0,1,0,null,null,null,null,1.9488506373398244,4.8721265933495614E-3,null,null,null,null,null,null,null,null,1,1,1,1,1,1,1,1,null,1,4.8721265933495614E-3,null,null,null,{"$f":"CB$149*(H$16+($BW437*MMULT($AD437:$AH437,CC$3:CC$7)))","v":-0.31320009876048305},-3.0029376245608743,-1.566879664111176,0,-1.12751759129246,0.73110360500624272,4.9641027265001386E-2,0.20869536707583894,0,0.32383615313740799,1.3132761524844909,0.55670210992800062,3.77993822328146E-2,0.15891202065995294,0,0.24658648717923196,615.03012454239206,41.759782022884956,175.56189946974405,0,272.42238751336555]
[null,null,null,null,null,null,null,null,null,null,null,null,null,null,null,null,null,null,null,null,null,null,null,null,null,null,null,null,51,-3.2656497071971831E-4,3.2656497071971831E-4,-1.2321265834925743,1.2321265834925743,-1.4804186264827487E-2,-1.1320851410974564,51,0,0,1,1,0,1,2.5000000000000001E-3,null,2,9.6673513660053524E-8,0.98162512822149262,1.8374775004993776E-2,0,1,0,null,null,null,null,1.9488506373398244,4.8721265933495614E-3,null,null,null,null,null,null,null,null,1,1,1,1,1,1,1,1,null,1,4.8721265933495614E-3,null,null,null,{"$f":"CB$149*(H$16+($BW438*MMULT($AD438:$AH438,CC$3:CC$7)))","v":-0.2338144216960667},-3.0823233016252907,-1.6025578050839813,0,-1.1320851410974564,0.79150868910699457,4.5852603375210355E-2,0.20138076593230073,0,0.32236038825976321,1.3611024466742689,0.58152028970411052,3.3687841416527503E-2,0.14795415762006486,0,0.23683771125929701,642.44860908988278,37.217457833330108,163.455935166838,0,261.65219145833544]
[null,null,null,null,null,null,null,null,null,null,null,null,null,null,null,null,null,null,null,null,null,null,null,null,null,null,null,null,52,-1.8373087893032745E-2,1.8373087893032745E-2,-1.1845183716881329,1.1845183716881329,-1.4804186264827487E-2,-1.1283389700645288,52,0,0,1,1,0,1,2.5000000000000001E-3,null,2,7.9508809248183958E-6,0.66830915654876977,0.33168289247030541,0,1,0,null,null,null,null,1.9488506373398244,4.8721265933495614E-3,null,null,null,null,null,null,null,null,1,1,1,1,1,1,1,1,null,1,4.8721265933495614E-3,null,null,null,{"$f":"CB$149*(H$16+($BW439*MMULT($AD439:$AH439,CC$3:CC$7)))","v":-0.29946915642282113},-3.0166685668985362,-1.5729961162018529,0,-1.1283389700645288,0.7412115836738955,4.8964067466089549E-2,0.20742278766444247,0,0.32357027020583889,1.3211687090102664,0.56102720161239894,3.706117707160219E-2,0.15699947043086582,0,0.24491215088513313,619.80837422004606,40.944232011233261,173.44896333278353,0,270.57262398432368]
[null,null,null,null,null,null,null,null,null,null,null,null,null,null,null,null,null,null,null,null,null,null,null,null,null,null,null,null,55,-1.1873477850503656E-2,1.1873477850503656E-2,-1.2021682569005963,1.2021682569005963,-1.4804186264827487E-2,-1.129558053663323,55,0,0,1,1,0,1,2.5000000000000001E-3,null,2,1.9472305844836428E-4,0.72681232147805352,0.27299295536349805,0,1,0,null,null,null,null,1.9488506373398244,4.8721265933495614E-3,null,null,null,null,null,null,null,null,1,1,1,1,1,1,1,1,null,1,4.8721265933495614E-3,null,null,null,{"$f":"CB$149*(H$16+($BW440*MMULT($AD440:$AH440,CC$3:CC$7)))","v":-0.27531966116782858},-3.0408180621535283,-1.584146391371787,0,-1.129558053663323,0.75932935631665233,4.7795773583289562E-2,0.20512281300995314,0,0.32317605133807437,1.3354239942479693,0.56860544635058852,3.5790710507792901E-2,0.15360126363871873,0,0.24200257950289991,628.18062343919178,39.540653337770664,169.69471216447857,0,267.35820460694549]
[null,null,null,null,null,null,null,null,null,null,null,null,null,null,null,null,null,null,null,null,null,null,null,null,null,null,null,null,56,-5.415082727596985E-5,5.415082727596985E-5,-1.2328452530552689,1.2328452530552689,-1.4804186264827487E-2,-1.1321416851191131,56,0,0,1,1,0,1,2.5000000000000001E-3,null,2,1.8803303742152827E-9,0.99583860320047879,4.1613948191908633E-3,0,1,0,null,null,null,null,1.9488506373398244,4.8721265933495614E-3,null,null,null,null,null,null,null,null,1,1,1,1,1,1,1,1,null,1,4.8721265933495614E-3,null,null,null,{"$f":"CB$149*(H$16+($BW441*MMULT($AD441:$AH441,CC$3:CC$7)))","v":-0.23282333798992827},-3.0833143853314287,-1.6030040605032321,0,-1.1321416851191131,0.79229352932897124,4.5807182118972563E-2,0.20129091872306359,0,0.32234216122230802,1.3617337913933156,0.58182703134531344,3.3638867162210172E-2,0.14781958118047747,0,0.23671452031199872,642.78748933917041,37.163352341012036,163.30725858932223,0,261.5160932788815]
[null,null,null,null,null,null,null,null,null,null,null,null,null,null,null,null,null,null,null,null,null,null,null,null,null,null,null,null,58,-3.2656497071971864E-4,3.2656497071971864E-4,-1.2321265834925743,1.2321265834925743,-1.4804186264827487E-2,-1.1320851410974566,58,0,0,1,1,0,1,2.5000000000000001E-3,null,2,9.6673513660053775E-8,0.9816251282214925,1.8374775004993793E-2,0,1,0,null,null,null,null,1.9488506373398244,4.8721265933495614E-3,null,null,null,null,null,null,null,null,1,1,1,1,1,1,1,1,null,1,4.8721265933495614E-3,null,null,null,{"$f":"CB$149*(H$16+($BW442*MMULT($AD442:$AH442,CC$3:CC$7)))","v":-0.2338144216960667},-3.0823233016252907,-1.6025578050839813,0,-1.1320851410974566,0.79150868910699457,4.5852603375210355E-2,0.20138076593230073,0,0.32236038825976315,1.3611024466742689,0.58152028970411052,3.3687841416527503E-2,0.14795415762006486,0,0.23683771125929698,642.44860908988278,37.217457833330108,163.455935166838,0,261.65219145833538]
[null,null,null,null,null,null,null,null,null,null,null,null,null,null,null,null,null,null,null,null,null,null,null,null,null,null,null,null,59,-7.390176458500027E-3,7.390176458500027E-3,-1.2134855780834066,1.2134855780834066,-1.4804186264827488E-2,-1.130620558425238,59,0,0,1,1,0,1,2.5000000000000001E-3,null,2,4.4221221421516588E-7,0.8569819712293355,0.14301758645845028,0,1,0,null,null,null,null,1.9488506373398244,4.8721265933495614E-3,null,null,null,null,null,null,null,null,1,1,1,1,1,1,1,1,null,1,4.8721265933495614E-3,null,null,null,{"$f":"CB$149*(H$16+($BW443*MMULT($AD443:$AH443,CC$3:CC$7)))","v":-0.25951903859301484},-3.0566186847283427,-1.5909804111625938,0,-1.130620558425238,0.77142252105475217,4.704650564263186E-2,0.2037257787633748,0,0.32283285759936803,1.3450276630601268,0.57353654667567033,3.4978095198127342E-2,0.15146586524463745,0,0.24001949288156493,633.62837582414022,38.642896914369828,167.3355791257529,0,265.16734168412358]
[null,null,null,null,null,null,null,null,null,null,null,null,null,null,null,null,null,null,null,null,null,null,null,null,null,null,null,null,70,-1.3318531510136371,1.3318531510136371,2.7288692591562861E-2,-2.7288692591562861E-2,-1.4804186264827488E-2,-0.27317538247787315,70,0,0,1,1,0,1,2.5000000000000001E-3,null,1,0.85605739552647442,5.7709943276655725E-5,0.14388489443024891,1,0,0,null,null,null,null,1.9488506373398244,4.8721265933495614E-3,null,null,null,null,null,null,null,null,1,1,1,1,1,1,1,1,null,1,4.8721265933495614E-3,null,null,null,{"$f":"CB$149*(H$16+($BW444*MMULT($AD444:$AH444,CC$3:CC$7)))","v":-2.8247562838231213},-0.49138143949823609,-1.6746691150427613,0,-0.27317538247787315,5.932311307007531E-2,0.61178067217721666,0.18737016719575084,0,0.76095931699449593,1.6194332694375388,3.663202071344341E-2,0.37777454849356046,0.11570107316668145,0,0.46989235762631459,40.47011114174223,417.35557215507907,127.82355980040334,0,519.12495045116179]
[null,null,null,null,null,null,null,null,null,null,null,null,null,null,null,null,null,null,null,null,null,null,null,null,null,null,null,null,75,-0.23830274391184911,0.23830274391184911,-0.67929847854828718,0.67929847854828718,-1.4804186264827487E-2,-1.0633033850982843,75,0,0,1,1,0,1,2.5000000000000001E-3,null,3,1.251219050544807E-2,0.12253285014275464,0.86495495925179733,0,0,1,null,null,null,null,1.9488506373398244,4.8721265933495614E-3,null,null,null,null,null,null,null,null,1,1,1,1,1,1,1,1,null,1,4.8721265933495614E-3,null,null,null,{"$f":"CB$149*(H$16+($BW445*MMULT($AD445:$AH445,CC$3:CC$7)))","v":-1.0246187055814833},-2.2915190177398741,-1.2877058790808236,0,-1.0633033850982843,0.35893329858079953,0.10111275307461014,0.27590301247972648,0,0.34531322161329675,1.0812622857484329,0.33195766033063062,9.3513622372042193E-2,0.25516751681461886,0,0.31936120048270833,366.73825648398162,103.31143674186127,281.90248760861493,0,352.82201271392864]
[null,null,null,null,null,null,null,null,null,null,null,null,null,null,null,null,null,null,null,null,null,null,null,null,null,null,null,null,86,-0.46810133969860707,0.46810133969860707,-3.1823706148102954E-2,3.1823706148102954E-2,-1.4804186264827487E-2,-1.0262639425404827,86,0,0,1,1,0,1,2.5000000000000001E-3,null,3,9.7080672545934339E-3,5.6172469239957612E-3,0.98467468572141081,0,0,1,null,null,null,null,1.9488506373398244,4.8721265933495614E-3,null,null,null,null,null,null,null,null,1,1,1,1,1,1,1,1,null,1,4.8721265933495614E-3,null,null,null,{"$f":"CB$149*(H$16+($BW446*MMULT($AD446:$AH446,CC$3:CC$7)))","v":-1.9018920737684253},-1.4142456495529319,-0.87002970246739719,0,-1.0262639425404827,0.1492858919164298,0.24310893362898867,0.4189391055377118,0,0.35834325376702103,1.1696771848501513,0.12762999385642884,0.2078427593337504,0.35816643340904575,0,0.30636081340077503,141.00232353532166,229.61931682781545,395.69303262558037,0,338.45952055966893]
[null,null,null,null,null,null,null,null,null,null,null,null,null,null,null,null,null,null,null,null,null,null,null,null,null,null,null,null,96,-1.2828544074827691E-4,1.2828544074827691E-4,-1.2326496103545324,1.2326496103545324,-1.4804186264827487E-2,-1.1321263139179174,96,0,0,1,1,0,1,2.5000000000000001E-3,null,2,4.2448077533778012E-9,0.99374505144687753,6.2549442083146937E-3,0,1,0,null,null,null,null,1.9488506373398244,4.8721265933495614E-3,null,null,null,null,null,null,null,null,1,1,1,1,1,1,1,1,null,1,4.8721265933495614E-3,null,null,null,{"$f":"CB$149*(H$16+($BW447*MMULT($AD447:$AH447,CC$3:CC$7)))","v":-0.23309311530413712},-3.0830446080172198,-1.6028825524159678,0,-1.1321263139179174,0.79207981533745331,4.5819541524604768E-2,0.20131537868359273,0,0.32234711604660271,1.3615618515922536,0.5817435428373452,3.3652192495715078E-2,0.14785621266354382,0,0.23674805200339577,642.6952533901092,37.17807382558869,163.34772810648533,0,261.55313822620303]
[null,null,null,null,null,null,null,null,null,null,null,null,null,null,null,null,null,null,null,null,null,null,null,null,null,null,null,null,97,-6.9441001566776406E-2,6.9441001566776406E-2,-1.0751088329519514,1.0751088329519514,-1.4804186264827487E-2,-1.1111945523623998,97,0,0,1,1,0,1,2.5000000000000001E-3,null,3,4.8297181444327741E-3,0.24205644997169753,0.7531138317838697,0,0,1,null,null,null,null,1.9488506373398244,4.8721265933495614E-3,null,null,null,null,null,null,null,null,1,1,1,1,1,1,1,1,null,1,4.8721265933495614E-3,null,null,null,{"$f":"CB$149*(H$16+($BW448*MMULT($AD448:$AH448,CC$3:CC$7)))","v":-0.45994660883274618},-2.856191114488611,-1.5146544911394149,0,-1.1111945523623998,0.63131735137741773,5.7487306361011105E-2,0.21988414364471878,0,0.32916552067904914,1.2378543220621967,0.51000940912471671,4.6441091925292499E-2,0.17763329636269637,0,0.26591620258729448,563.4452336678479,51.306919879271504,196.24468173643939,0,293.77735826482757]
[null,null,null,null,null,null,null,null,null,null,null,null,null,null,null,null,null,null,null,null,null,null,null,null,null,null,null,null,151,-0.8945066155846596,0.8945066155846596,-9.216792644829026E-4,9.216792644829026E-4,-1.4804186264827487E-2,-0.65493410499667859,151,0,0,1,1,0,1,2.5000000000000001E-3,null,3,0.25334153261510794,2.0151558173381635E-3,0.74464331146755391,0,0,1,null,null,null,null,1.9488506373398244,4.8721265933495614E-3,null,null,null,null,null,null,null,null,1,1,1,1,1,1,1,1,null,1,4.8721265933495614E-3,null,null,null,{"$f":"CB$149*(H$16+($BW449*MMULT($AD449:$AH449,CC$3:CC$7)))","v":-2.3591993765380979},-0.95693834678325929,-1.2655329514698297,0,-0.65493410499667859,9.4495848511932698E-2,0.38406696760940512,0.28208891636892114,0,0.51947629235126047,1.2801280248415194,7.3817498467492221E-2,0.30002231039114452,0.22035992564403384,0,0.40580026549732939,81.55166733918297,331.45690600890038,243.44795914376988,0,448.31766105653321]
[null,null,null,null,null,null,null,null,null,null,null,null,null,null,null,null,null,null,null,null,null,null,null,null,null,null,null,null,161,-1.3318531510136364,1.3318531510136364,2.728869259156284E-2,-2.728869259156284E-2,-1.4804186264827487E-2,-0.27317538247787354,161,0,0,1,1,0,1,2.5000000000000001E-3,null,1,0.85605739552647442,5.7709943276655623E-5,0.14388489443024891,1,0,0,null,null,null,null,1.9488506373398244,4.8721265933495614E-3,null,null,null,null,null,null,null,null,1,1,1,1,1,1,1,1,null,1,4.8721265933495614E-3,null,null,null,{"$f":"CB$149*(H$16+($BW450*MMULT($AD450:$AH450,CC$3:CC$7)))","v":-2.8247562838231204},-0.49138143949823676,-1.6746691150427608,0,-0.27317538247787354,5.9323113070075366E-2,0.61178067217721621,0.18737016719575092,0,0.7609593169944957,1.6194332694375382,3.6632020713443465E-2,0.37777454849356035,0.11570107316668155,0,0.46989235762631465,40.470111141742294,417.35557215507896,127.82355980040346,0,519.12495045116179]
[null,null,null,null,null,null,null,null,null,null,null,null,null,null,null,null,null,null,null,null,null,null,null,null,null,null,null,null,227,-0.81390602893858044,0.81390602893858044,-6.2224250157973324E-2,6.2224250157973324E-2,-1.4804186264827487E-2,-0.71078644666775026,227,0,0,1,1,0,1,2.5000000000000001E-3,null,3,0.16187508574028112,9.4091703177113222E-3,0.82871574384200752,0,0,1,null,null,null,null,1.9488506373398244,4.8721265933495614E-3,null,null,null,null,null,null,null,null,1,1,1,1,1,1,1,1,null,1,4.8721265933495614E-3,null,null,null,{"$f":"CB$149*(H$16+($BW451*MMULT($AD451:$AH451,CC$3:CC$7)))","v":-2.2172962189985284},-1.0988415043228288,-1.2462349357172409,0,-0.71078644666775026,0.108903161417755,0.33325693687106067,0.28758553909298701,0,0.49125769752086895,1.2210033349026717,8.9191534785149351E-2,0.27293695876565738,0.23553214874381237,0,0.40233935770538087,98.536505913606234,301.53370850987835,260.20983968316386,0,444.49413944173796]
[null,null,null,null,null,null,null,null,null,null,null,null,null,null,null,null,null,null,null,null,null,null,null,null,null,null,null,null,232,-1.3540934809742213,1.3540934809742213,2.8247927598335089E-2,-2.8247927598335089E-2,-1.4804186264827487E-2,-0.25363896845398309,232,0,0,1,1,0,1,2.5000000000000001E-3,null,1,0.91198478587791476,8.4132981150431009E-6,8.8006800723970227E-2,1,0,0,null,null,null,null,1.9488506373398244,4.8721265933495614E-3,null,null,null,null,null,null,null,null,1,1,1,1,1,1,1,1,null,1,4.8721265933495614E-3,null,null,null,{"$f":"CB$149*(H$16+($BW452*MMULT($AD452:$AH452,CC$3:CC$7)))","v":-2.8479558487904777},-0.46818187453087945,-1.6959502099965733,0,-0.25363896845398309,5.7962684348522031E-2,0.62613963444881626,0.18342485406446946,0,0.77597190181638553,1.6434990746781932,3.5267853351162649E-2,0.38097960874813275,0.11160630199952204,0,0.4721462359011826,38.963014244213475,420.89644001309819,123.29976228643963,0,521.61497700463519]
[null,null,null,null,null,null,null,null,null,null,null,null,null,null,null,null,null,null,null,null,null,null,null,null,null,null,null,null,240,-4.426512349400287E-2,4.426512349400287E-2,-1.1165324745496885,1.1165324745496885,-1.4804186264827487E-2,-1.1228816193501661,240,0,0,1,1,0,1,2.5000000000000001E-3,null,3,1.1077085420576749E-4,0.403839576103666,0.59604965294212819,0,0,1,null,null,null,null,1.9488506373398244,4.8721265933495614E-3,null,null,null,null,null,null,null,null,1,1,1,1,1,1,1,1,null,1,4.8721265933495614E-3,null,null,null,{"$f":"CB$149*(H$16+($BW453*MMULT($AD453:$AH453,CC$3:CC$7)))","v":-0.39334708916223549},-2.9227906341591217,-1.5309022546643785,0,-1.1228816193501661,0.6747944930796006,5.3783387923076187E-2,0.21634038511055495,0,0.3253409338226807,1.2702591999359125,0.5312258262830496,4.2340482891830018E-2,0.17031200019765244,0,0.25612169062746792,586.88458382393139,46.776672841270759,188.15630266997411,0,282.95663421321024]
[null,null,null,null,null,null,null,null,null,null,null,null,null,null,null,null,null,null,null,null,null,null,null,null,null,null,null,null,241,-1.3318531510136371,1.3318531510136371,2.7288692591562861E-2,-2.7288692591562861E-2,-1.4804186264827488E-2,-0.27317538247787315,241,0,0,1,1,0,1,2.5000000000000001E-3,null,1,0.85605739552647442,5.7709943276655623E-5,0.14388489443024891,1,0,0,null,null,null,null,1.9488506373398244,4.8721265933495614E-3,null,null,null,null,null,null,null,null,1,1,1,1,1,1,1,1,null,1,4.8721265933495614E-3,null,null,null,{"$f":"CB$149*(H$16+($BW454*MMULT($AD454:$AH454,CC$3:CC$7)))","v":-2.8247562838231213},-0.49138143949823609,-1.6746691150427613,0,-0.27317538247787315,5.932311307007531E-2,0.61178067217721666,0.18737016719575084,0,0.76095931699449593,1.6194332694375388,3.663202071344341E-2,0.37777454849356046,0.11570107316668145,0,0.46989235762631459,40.47011114174223,417.35557215507907,127.82355980040334,0,519.12495045116179]
[null,null,null,null,null,null,null,null,null,null,null,null,null,null,null,null,null,null,null,null,null,null,null,null,null,null,null,null,261,-1.3627610285077711,1.3627610285077711,2.8573667787641123E-2,-2.8573667787641123E-2,-1.4804186264827487E-2,-0.24601276331552163,261,0,0,1,1,0,1,2.5000000000000001E-3,null,1,0.96442217663904473,5.3819412264480939E-7,3.5577285066832658E-2,1,0,0,null,null,null,null,1.9488506373398244,4.8721265933495614E-3,null,null,null,null,null,null,null,null,1,1,1,1,1,1,1,1,null,1,4.8721265933495614E-3,null,null,null,{"$f":"CB$149*(H$16+($BW455*MMULT($AD455:$AH455,CC$3:CC$7)))","v":-2.8569491365133333},-0.45918858680802366,-1.7042920173408171,0,-0.24601276331552163,5.7443746228503213E-2,0.63179608525684028,0.18190112343919582,0,0.78191224506909529,1.6530531999936346,3.4750089246204784E-2,0.38219948714250279,0.11003948538371074,0,0.47301093822758167,38.391001822710351,422.24413018246543,121.56878372326848,0,522.57027781994225]
[null,null,null,null,null,null,null,null,null,null,null,null,null,null,null,null,null,null,null,null,null,null,null,null,null,null,null,null,263,-0.27502040713322845,0.27502040713322845,-0.5277425910351855,0.5277425910351855,-1.4804186264827487E-2,-1.0698201009236039,263,0,0,1,1,0,1,2.5000000000000001E-3,null,3,2.3745442243262517E-3,5.1382563329862456E-2,0.94624289234581127,0,0,1,null,null,null,null,{"$f":"$BC$424/$BB$424","v":1.9488506373398244},4.8721265933495614E-3,null,null,null,null,null,null,null,null,1,1,1,1,1,1,1,1,null,1,4.8721265933495614E-3,null,null,null,{"$f":"CB$149*(H$16+($BW456*MMULT($AD456:$AH456,CC$3:CC$7)))","v":-1.2128922563159641},-2.1032454670053928,-1.172867654789101,0,-1.0698201009236039,0.29733606249546241,0.12205964417857849,0.3094781909435938,0,0.34307022988502772,1.0719441275026624,0.27738018695822736,0.11386754313673436,0.28870738968885779,0,0.32004488021618049,306.44247235307631,125.79792314022181,318.95647361496759,0,353.57732444012072]
[null,null,null,null,null,null,null,null,null,null,null,null,null,null,null,null,null,null,null,null,null,null,null,null,null,null,null,null,301,-6.9441001566776267E-2,6.9441001566776267E-2,-1.0751088329519516,1.0751088329519516,-1.4804186264827487E-2,-1.1111945523623998,301,0,0,1,1,0,1,2.5000000000000001E-3,null,3,4.8297181444327758E-3,0.2420564499716972,0.75311383178387004,0,0,1,null,null,null,null,1.9488506373398244,4.8721265933495614E-3,null,null,null,null,null,null,null,null,1,1,1,1,1,1,1,1,null,1,4.8721265933495614E-3,null,null,null,{"$f":"CB$149*(H$16+($BW457*MMULT($AD457:$AH457,CC$3:CC$7)))","v":-0.45994660883274596},-2.8561911144886114,-1.5146544911394151,0,-1.1111945523623998,0.63131735137741785,5.7487306361011077E-2,0.21988414364471875,0,0.32916552067904914,1.2378543220621969,0.51000940912471671,4.6441091925292471E-2,0.17763329636269631,0,0.26591620258729443,563.4452336678479,51.306919879271476,196.24468173643936,0,293.77735826482757]
[null,null,null,null,null,null,null,null,null,null,null,null,null,null,null,null,null,null,null,null,null,null,null,null,null,null,null,null,303,-0.15197713787977821,0.15197713787977821,-0.8320701538079307,0.8320701538079307,-1.4804186264827487E-2,-1.1006022438828957,303,0,0,1,1,0,1,2.5000000000000001E-3,null,3,4.7544798668353699E-5,0.24174541874537314,0.75820703635595854,0,0,1,null,null,null,null,1.9488506373398244,4.8721265933495614E-3,null,null,null,null,null,null,null,null,1,1,1,1,1,1,1,1,null,1,4.8721265933495614E-3,null,null,null,{"$f":"CB$149*(H$16+($BW458*MMULT($AD458:$AH458,CC$3:CC$7)))","v":-0.78552142428976868},-2.5306162990315886,-1.3541519483083961,0,-1.1006022438828957,0.45588193188897302,7.9609941633954809E-2,0.25816613987422954,0,0.33267067447780035,1.1263286878749577,0.40475035111560964,7.068091445327096E-2,0.22921030304334264,0,0.29535843138777679,447.15774274217392,78.086450264374918,253.22562769769013,0,326.30437284414757]
[null,null,null,null,null,null,null,null,null,null,null,null,null,null,null,null,null,null,null,null,null,null,null,null,null,null,null,null,312,-0.50312778154705162,0.50312778154705162,-0.12403331668249989,0.12403331668249989,-1.4804186264827487E-2,-0.97126763516016079,312,0,0,1,1,0,1,2.5000000000000001E-3,null,3,2.8059161111326312E-2,1.164108751401996E-2,0.96029975127465372,0,0,1,null,null,null,null,1.9488506373398244,4.8721265933495614E-3,null,null,null,null,null,null,null,null,1,1,1,1,1,1,1,1,null,1,4.8721265933495614E-3,null,null,null,{"$f":"CB$149*(H$16+($BW459*MMULT($AD459:$AH459,CC$3:CC$7)))","v":-1.844708905082473},-1.4714288182388842,-0.99726575485023861,0,-0.97126763516016079,0.15807132795328566,0.22959719804708156,0.36888669015446135,0,0.37860280356108122,1.1351580197159099,0.13925050539910325,0.20226012066984442,0.32496505662425812,0,0.33352431730679416,153.84036480349951,223.45176170002671,359.01300836347053,0,368.4690586813897]
[null,null,null,null,null,null,null,null,null,null,null,null,null,null,null,null,null,null,null,null,null,null,null,null,null,null,null,null,313,-1.3656322503361624,1.3656322503361624,2.8552397421218841E-2,-2.8552397421218841E-2,-1.4804186264827487E-2,-0.24345310374728782,313,0,0,1,1,0,1,2.5000000000000001E-3,null,1,0.87339745380478995,1.8227556324308608E-5,0.12658431853888572,1,0,0,null,null,null,null,1.9488506373398244,4.8721265933495614E-3,null,null,null,null,null,null,null,null,1,1,1,1,1,1,1,1,null,1,4.8721265933495614E-3,null,null,null,{"$f":"CB$149*(H$16+($BW460*MMULT($AD460:$AH460,CC$3:CC$7)))","v":-2.8597990879753024},-0.45633863534605479,-1.7071845095356308,0,-0.24345310374728782,5.7280267403966752E-2,0.63359924166733861,0.1813757360651643,0,0.78391623790426712,1.6561714830407368,3.4585951992604037E-2,0.38256862176134571,0.10951507010141112,0,0.47333035614463914,38.209667220732335,422.65194058330837,120.98942325268149,0,522.92316249166424]
[null,null,null,null,null,null,null,null,null,null,null,null,null,null,null,null,null,null,null,null,null,null,null,null,null,null,null,null,316,-0.43509034163615268,0.43509034163615268,-0.24076660241429107,0.24076660241429107,-1.4804186264827488E-2,-1.0016143697325792,316,0,0,1,1,0,1,2.5000000000000001E-3,null,3,2.3792689670451232E-2,3.1885530574338398E-2,0.94432177965521036,0,0,1,null,null,null,null,1.9488506373398244,4.8721265933495614E-3,null,null,null,null,null,null,null,null,1,1,1,1,1,1,1,1,null,1,4.8721265933495614E-3,null,null,null,{"$f":"CB$149*(H$16+($BW461*MMULT($AD461:$AH461,CC$3:CC$7)))","v":-1.6599381794397829},-1.6561995438815746,-1.045961600671131,0,-1.0016143697325792,0.19015073496313181,0.19086296982597759,0.35135379483688139,0,0.36728602686030754,1.0996535264862983,0.17291876976079618,0.17356646000657894,0.31951317971902965,0,0.33400159051359518,191.03619441186271,191.75174588081651,352.98991545217166,0,368.99633780353554]
[null,null,null,null,null,null,null,null,null,null,null,null,null,null,null,null,null,null,null,null,null,null,null,null,null,null,null,null,317,-0.48033720151642473,0.48033720151642473,-6.1127260964679679E-3,6.1127260964679679E-3,-1.4804186264827487E-2,-1.0220259742439599,317,0,0,1,1,0,1,2.5000000000000001E-3,null,3,1.685967045410822E-2,1.3349676476707374E-3,0.98180536179822109,0,0,1,null,null,null,null,1.9488506373398244,4.8721265933495614E-3,null,null,null,null,null,null,null,null,1,1,1,1,1,1,1,1,null,1,4.8721265933495614E-3,null,null,null,{"$f":"CB$149*(H$16+($BW462*MMULT($AD462:$AH462,CC$3:CC$7)))","v":-1.9398389156378779},-1.3762988076834792,-0.85655458423357977,0,-1.0220259742439599,0.14372710010131479,0.25251141896046442,0.42462256617019356,0,0.35986512365615042,1.1807262088881232,0.12172771216509287,0.21386111111927603,0.35962830584582006,0,0.3047828708698111,134.48163503968058,236.26823656816001,397.30807156798835,0,336.71625037255757]
[null,null,null,null,null,null,null,null,null,null,null,null,null,null,null,null,null,null,null,null,null,null,null,null,null,null,null,null,321,-0.43856877573637043,0.43856877573637043,-7.9683950171202111E-2,7.9683950171202111E-2,-1.4804186264827487E-2,-1.0401626286034948,321,0,0,1,1,0,1,2.5000000000000001E-3,null,3,1.2489362867338096E-3,1.6661335595280061E-2,0.98208972801798611,0,0,1,null,null,null,null,1.9488506373398244,4.8721265933495614E-3,null,null,null,null,null,null,null,null,1,1,1,1,1,1,1,1,null,1,4.8721265933495614E-3,null,null,null,{"$f":"CB$149*(H$16+($BW463*MMULT($AD463:$AH463,CC$3:CC$7)))","v":-1.8244992657830896},-1.4916384575382677,-0.88835738252825969,0,-1.0401626286034948,0.16129839153536948,0.22500369435920528,0.41133085738422209,0,0.35339720479129688,1.1510301480700937,0.14013394158772891,0.19548027889318442,0.35735889114102809,0,0.30702688837805858,154.8163623063399,215.9615674688315,394.80088076767493,0,339.19538300554012]
[null,null,null,null,null,null,null,null,null,null,null,null,null,null,null,null,null,null,null,null,null,null,null,null,null,null,null,null,322,-3.5208959801317141E-4,3.5208959801317141E-4,-1.2320614956947222,1.2320614956947222,-1.4804186264827487E-2,-1.1320792613756891,322,0,0,1,1,0,1,2.5000000000000001E-3,null,2,9.6792407517737829E-7,0.96435849187872991,3.5640540097194952E-2,0,1,0,null,null,null,null,1.9488506373398244,4.8721265933495614E-3,null,null,null,null,null,null,null,null,1,1,1,1,1,1,1,1,null,1,4.8721265933495614E-3,null,null,null,{"$f":"CB$149*(H$16+($BW464*MMULT($AD464:$AH464,CC$3:CC$7)))","v":-0.23390503412121211},-3.0822326892001453,-1.6025182419134225,0,-1.1320792613756891,0.79143697183443795,4.5856758379046056E-2,0.20138873335149768,0,0.32236228365472713,1.3610447472197087,0.58149224957603762,3.3692322366858637E-2,0.14796628381461158,0,0.2368491442424922,642.41763108000407,37.222408271618512,163.46933187363916,0,261.66482232312478]
[null,null,null,null,null,null,null,null,null,null,null,null,null,null,null,null,null,null,null,null,null,null,null,null,null,null,null,null,326,-0.81390602893858077,0.81390602893858077,-6.2224250157973379E-2,6.2224250157973379E-2,-1.4804186264827485E-2,-0.71078644666774982,326,0,0,1,1,0,1,2.5000000000000001E-3,null,3,0.16187508574028084,9.4091703177112927E-3,0.82871574384200786,0,0,1,null,null,null,null,1.9488506373398244,4.8721265933495614E-3,null,null,null,null,null,null,null,null,1,1,1,1,1,1,1,1,null,1,4.8721265933495614E-3,null,null,null,{"$f":"CB$149*(H$16+($BW465*MMULT($AD465:$AH465,CC$3:CC$7)))","v":-2.2172962189985284},-1.0988415043228283,-1.2462349357172413,0,-0.71078644666774982,0.108903161417755,0.33325693687106084,0.2875855390929869,0,0.49125769752086917,1.2210033349026719,8.9191534785149323E-2,0.27293695876565749,0.23553214874381223,0,0.40233935770538098,98.536505913606206,301.53370850987847,260.20983968316375,0,444.49413944173807]
[null,null,null,null,null,null,null,null,null,null,null,null,null,null,null,null,null,null,null,null,null,null,null,null,null,null,null,null,329,-0.57225967405344436,0.57225967405344436,2.3598333447973868E-3,-2.3598333447973868E-3,-1.4804186264827488E-2,-0.94244454298666835,329,0,0,1,1,0,1,2.5000000000000001E-3,null,3,0.16658740688529328,2.528990483238999E-4,0.83315969396638279,0,0,1,null,null,null,null,1.9488506373398244,4.8721265933495614E-3,null,null,null,null,null,null,null,null,1,1,1,1,1,1,1,1,null,1,4.8721265933495614E-3,null,null,null,{"$f":"CB$149*(H$16+($BW466*MMULT($AD466:$AH466,CC$3:CC$7)))","v":-2.0402339476161631},-1.2759037757051943,-0.94000449732933422,0,-0.94244454298666835,0.12999829452953804,0.27917853938775566,0.39062607858044879,0,0.38967409502776229,1.1894770075255048,0.10929029624538633,0.23470696585261192,0.3284015379104106,0,0.32760119999159115,120.74109889716092,259.29819892000796,362.80954420502371,0,361.92535152619377]
[null,null,null,null,null,null,null,null,null,null,null,null,null,null,null,null,null,null,null,null,null,null,null,null,null,null,null,null,330,-0.4350903416361529,0.4350903416361529,-0.24076660241429038,0.24076660241429038,-1.4804186264827487E-2,-1.0016143697325792,330,0,0,1,1,0,1,2.5000000000000001E-3,null,3,2.3792689670451235E-2,3.1885530574338343E-2,0.94432177965521047,0,0,1,null,null,null,null,1.9488506373398244,4.8721265933495614E-3,null,null,null,null,null,null,null,null,1,1,1,1,1,1,1,1,null,1,4.8721265933495614E-3,null,null,null,{"$f":"CB$149*(H$16+($BW467*MMULT($AD467:$AH467,CC$3:CC$7)))","v":-1.6599381794397838},-1.6561995438815735,-1.0459616006711303,0,-1.0016143697325792,0.19015073496313165,0.19086296982597781,0.35135379483688167,0,0.36728602686030754,1.0996535264862985,0.17291876976079601,0.1735664600065791,0.31951317971902987,0,0.33400159051359513,191.03619441186251,191.75174588081669,352.98991545217189,0,368.99633780353543]
[null,null,null,null,null,null,null,null,null,null,null,null,null,null,null,null,null,null,null,null,null,null,null,null,null,null,null,null,331,-0.87787280548433588,0.87787280548433588,6.686219771822384E-3,-6.686219771822384E-3,-1.4804186264827485E-2,-0.67169785996374642,331,0,0,1,1,0,1,2.5000000000000001E-3,null,3,0.33777291092734307,1.1876520230877298E-3,0.66103943694956913,0,0,1,null,null,null,null,1.9488506373398244,4.8721265933495614E-3,null,null,null,null,null,null,null,null,1,1,1,1,1,1,1,1,null,1,4.8721265933495614E-3,null,null,null,{"$f":"CB$149*(H$16+($BW468*MMULT($AD468:$AH468,CC$3:CC$7)))","v":-2.3501734654740791},-0.96596425784727746,-1.2412912423332005,0,-0.67169785996374642,9.5352620393372362E-2,0.38061601076018581,0.28901079392861723,0,0.51084050542040582,1.275819930502581,7.4738306020827178E-2,0.29833051017650314,0.22652945530860913,0,0.40040172849406069,82.56895176133186,329.58784879112494,250.26389630352392,0,442.35349669240588]
[null,null,null,null,null,null,null,null,null,null,null,null,null,null,null,null,null,null,null,null,null,null,null,null,null,null,null,null,332,-0.82103687465436281,0.82103687465436281,-2.1820398576502906E-2,2.1820398576502906E-2,-1.4804186264827487E-2,-0.71488811660859275,332,0,0,1,1,0,1,2.5000000000000001E-3,null,3,0.22551096894028011,5.7943022616874793E-3,0.76869472869803235,0,0,1,null,null,null,null,1.9488506373398244,4.8721265933495614E-3,null,null,null,null,null,null,null,null,1,1,1,1,1,1,1,1,null,1,4.8721265933495614E-3,null,null,null,{"$f":"CB$149*(H$16+($BW469*MMULT($AD469:$AH469,CC$3:CC$7)))","v":-2.2648309162957814},-1.051306807025576,-1.2129619298515528,0,-0.71488811660859275,0.10384759199194385,0.34948074667413731,0.29731534676240784,0,0.48924684733079049,1.2398905327592795,8.3755451992071545E-2,0.28186419481435609,0.23979160974860883,0,0.39458874344496353,92.530861929821441,311.39628851619557,264.91558227968875,0,435.93146082268072]
[null,null,null,null,null,null,null,null,null,null,null,null,null,null,null,null,null,null,null,null,null,null,null,null,null,null,null,null,342,-0.53536007586774859,0.53536007586774859,-2.2538658411405989E-2,2.2538658411405989E-2,-1.4804186264827485E-2,-0.96883274203265501,342,0,0,1,1,0,1,2.5000000000000001E-3,null,3,6.1525446931158502E-2,4.987672888118252E-3,0.93348688008072322,0,0,1,null,null,null,null,1.9488506373398244,4.8721265933495614E-3,null,null,null,null,null,null,null,null,1,1,1,1,1,1,1,1,null,1,4.8721265933495614E-3,null,null,null,{"$f":"CB$149*(H$16+($BW470*MMULT($AD470:$AH470,CC$3:CC$7)))","v":-1.9784358576742636},-1.3377018656470931,-0.92800339089984174,0,-0.96883274203265501,0.13828536623298635,0.26244811709511545,0.39534226685779683,0,0.37952578414906524,1.1756015343349637,0.11762945368322797,0.2232458102766785,0.3362893423590515,0,0.32283539368104219,129.95398483042547,246.63621001147359,371.52378700363835,0,356.66021170284927]
[null,null,null,null,null,null,null,null,null,null,null,null,null,null,null,null,null,null,null,null,null,null,null,null,null,null,null,null,344,-0.15197713787977837,0.15197713787977837,-0.83207015380793026,0.83207015380793026,-1.4804186264827485E-2,-1.1006022438828957,344,0,0,1,1,0,1,2.5000000000000001E-3,null,3,4.7544798668353536E-5,0.24174541874537314,0.75820703635595854,0,0,1,null,null,null,null,1.9488506373398244,4.8721265933495614E-3,null,null,null,null,null,null,null,null,1,1,1,1,1,1,1,1,null,1,4.8721265933495614E-3,null,null,null,{"$f":"CB$149*(H$16+($BW471*MMULT($AD471:$AH471,CC$3:CC$7)))","v":-0.78552142428976912},-2.5306162990315877,-1.3541519483083957,0,-1.1006022438828957,0.45588193188897286,7.9609941633954878E-2,0.25816613987422965,0,0.33267067447780035,1.1263286878749577,0.40475035111560953,7.0680914453271015E-2,0.22921030304334275,0,0.29535843138777679,447.15774274217381,78.086450264374989,253.22562769769027,0,326.30437284414757]
[null,null,null,null,null,null,null,null,null,null,null,null,null,null,null,null,null,null,null,null,null,null,null,null,null,null,null,null,347,-0.32972835014791918,0.32972835014791918,-0.36322135039754283,0.36322135039754283,-1.4804186264827488E-2,-1.063684915510055,347,0,0,1,1,0,1,2.5000000000000001E-3,null,3,1.0149497598743483E-4,7.0620486613171413E-2,0.92927801831084111,0,0,1,null,null,null,null,1.9488506373398244,4.8721265933495614E-3,null,null,null,null,null,null,null,null,1,1,1,1,1,1,1,1,null,1,4.8721265933495614E-3,null,null,null,{"$f":"CB$149*(H$16+($BW472*MMULT($AD472:$AH472,CC$3:CC$7)))","v":-1.4321214399682978},-1.8840162833530598,-1.0630543571661493,0,-1.063684915510055,0.23880178085654002,0.15197848968914734,0.34539922495898723,0,0.3451814992473069,1.0813609947519813,0.22083446879948829,0.14054371336373642,0.3194115809940114,0,0.31921023684276406,243.97222217564098,155.26906758971748,352.87767180267406,0,352.65523198035413]
[null,null,null,null,null,null,null,null,null,null,null,null,null,null,null,null,null,null,null,null,null,null,null,null,null,null,null,null,348,-0.53536085934190314,0.53536085934190314,-8.4481297487739564E-3,8.4481297487739564E-3,-1.4804186264827487E-2,-0.97247468410407478,348,0,0,1,1,0,1,2.5000000000000001E-3,null,3,8.9782795152242911E-2,3.2173511598843217E-3,0.90699985358787272,0,0,1,null,null,null,null,1.9488506373398244,4.8721265933495614E-3,null,null,null,null,null,null,null,null,1,1,1,1,1,1,1,1,null,1,4.8721265933495614E-3,null,null,null,{"$f":"CB$149*(H$16+($BW473*MMULT($AD473:$AH473,CC$3:CC$7)))","v":-1.9925271698110505},-1.3236105535103069,-0.91391364571136424,0,-0.97247468410407478,0.13635040903418186,0.26617253477074226,0.40095196546882828,0,0.37814608714186743,1.1816209964156199,0.11539267620310834,0.22526049856778232,0.33932366358171806,0,0.32002316164739125,127.48285079367908,248.86198564352915,374.87602678537655,0,353.5533303258016]
[null,null,null,null,null,null,null,null,null,null,null,null,null,null,null,null,null,null,null,null,null,null,null,null,null,null,null,null,352,-0.36447707139307106,0.36447707139307106,-0.29607764896919242,0.29607764896919242,-1.4804186264827487E-2,-1.050131176434886,352,0,0,1,1,0,1,2.5000000000000001E-3,null,3,3.6245904163952299E-3,3.4670220100339662E-2,0.9617051893832651,{"$f":"IF($AS474= 1,1,0)","v":0},{"$f":"IF($AS474= 2,1,0)","v":0},{"$f":"IF($AS474= 3,1,0)","v":1},null,null,null,null,1.9488506373398244,{"$f":"AQ474*BD474","v":4.8721265933495614E-3},null,null,null,null,null,null,null,null,{"$f":"INDEX(AK$148:AK$149,2-AK474)","v":1},{"$f":"INDEX(AL$148:AL$149,2-AL474)","v":1},{"$f":"INDEX(AM$148:AM$149,2-AM474)","v":1},{"$f":"INDEX(AN$148:AN$149,2-AN474)","v":1},{"$f":"INDEX(AO$148:AO$149,2-AO474)","v":1},{"$f":"INDEX(AW$148:AW$149,2-AW474)","v":1},{"$f":"INDEX(AX$148:AX$149,2-AX474)","v":1},{"$f":"INDEX(AY$148:AY$149,2-AY474)","v":1},null,1,4.8721265933495614E-3,null,null,null,{"$f":"CB$149*(H$16+($BW474*MMULT($AD474:$AH474,CC$3:CC$7)))","v":-1.5340138626417998},-1.7821238606795573,-1.0306593769829506,0,-1.050131176434886,{"$f":"$BW474*IF(CB$149=0,0,IF(ABS(CB474)>OverflowTrigger,OverflowTrigger,EXP(CB474)))","v":0.21566826487204924},{"$f":"$BW474*IF(CC$149=0,0,IF(ABS(CC474)>OverflowTrigger,OverflowTrigger,EXP(CC474)))","v":0.16828036341455849},{"$f":"$BW474*IF(CD$149=0,0,IF(ABS(CD474)>OverflowTrigger,OverflowTrigger,EXP(CD474)))","v":0.35677163598892692},{"$f":"$BW474*IF(CE$149=0,0,IF(ABS(CE474)>OverflowTrigger,OverflowTrigger,EXP(CE474)))","v":0},{"$f":"IF(L$12=\"\",0,$BW474*IF($CG$149=0,0,IF(ABS(CF474)>OverflowTrigger,OverflowTrigger,EXP(CF474))))","v":0.34989184853539768},1.0906121128109323,0.19774974286337982,{"$f":"IF($CL474=0,0,CH474/$CL474)","v":0.15429900460286877},{"$f":"IF($CL474=0,0,CI474/$CL474)","v":0.32712972082199548},{"$f":"IF($CL474=0,0,CJ474/$CL474)","v":0},{"$f":"IF($CL474=0,0,CK474/$CL474)","v":0.32082153171175598},{"$f":"CM474*$BX474*TargetMarketSize","v":218.46881269629122},{"$f":"CN474*$BX474*TargetMarketSize","v":170.46555837545313},{"$f":"CO474*$BX474*TargetMarketSize","v":361.40447350682882},{"$f":"CP474*$BX474*TargetMarketSize","v":0},{"$f":"CQ474*$BX474*TargetMarketSize","v":354.43534896981328}]
[null,null,null,null,null,null,null,null,null,null,null,null,null,null,null,null,null,null,null,null,null,null,null,null,null,null,null,null,353,-0.42227886849098167,0.42227886849098167,-0.14507790395693823,0.14507790395693823,-1.4804186264827487E-2,-1.0377482482018452,353,0,0,1,1,0,1,{"$f":"AP475/$AP$554","v":2.5000000000000001E-3},null,3,5.4978144980592364E-3,2.3246089219375179E-2,0.97125609618256559,0,0,1,null,null,null,null,1.9488506373398244,4.8721265933495614E-3,null,null,null,null,null,null,null,null,1,1,1,1,1,1,1,1,null,{"$f":"IF(AND(BN475:BU475),1,0)","v":1},{"$f":"BE475*BW475","v":4.8721265933495614E-3},null,null,null,{"$f":"CB$149*(H$16+($BW475*MMULT($AD475:$AH475,CC$3:CC$7)))","v":-1.7428154047519646},-1.5733223185693925,-0.93746142906860708,0,{"$f":"IF($CG$149=0,0,$L$16+$AI475)","v":-1.0377482482018452},0.17502693462623567,0.20735513689454518,0.3916207315618615,0,0.35425147092326986,{"$f":"IF($CG$149=0,0,SUM(CG475:CK475))","v":1.1282542740059123},{"$f":"IF($CL475=0,0,CG475/$CL475)","v":0.1551307525783133},0.18378404733032599,0.34710325552004895,0,0.31398194457131168,171.38445207426034,203.03987267641941,383.47071919518163,0,346.87914960252505]
[null,null,null,null,null,null,null,null,null,null,null,null,null,null,null,null,null,null,null,null,null,null,null,null,null,null,null,null,361,-8.9429502030233601E-3,8.9429502030233601E-3,-1.2093938693245745,1.2093938693245745,-1.4804186264827488E-2,-1.1302970287921654,361,0,0,1,1,0,1,2.5000000000000001E-3,null,2,3.1260334977256058E-6,0.84876414708152736,0.15123272678497493,0,1,0,null,null,null,null,1.9488506373398244,4.8721265933495614E-3,null,null,null,null,null,null,null,null,1,1,1,1,1,1,1,1,null,1,4.8721265933495614E-3,null,null,null,{"$f":"CB$149*(H$16+($BW476*MMULT($AD476:$AH476,CC$3:CC$7)))","v":-0.26516352109637031},-3.0509742022249871,-1.588441476148285,0,-1.1302970287921654,0.76708050587443188,4.7312809687796553E-2,0.20424368246010047,0,0.32293732049284052,1.3415743185151694,0.5717763789064052,3.5266633413318114E-2,0.15224179506220256,0,0.24071519261807411,631.6837878963405,38.961666488365097,168.19280636420356,0,265.93593279947731]
[null,null,null,null,null,null,null,null,null,null,null,null,null,null,null,null,null,null,null,null,null,null,null,null,null,null,null,null,364,-0.57916816679859806,0.57916816679859806,3.4892558772515697E-3,-3.4892558772515697E-3,-1.4804186264827487E-2,-0.93659091055329835,364,0,0,1,1,0,1,2.5000000000000001E-3,null,3,0.34340865418100902,3.153619849452975E-5,0.65655980952049642,0,0,1,null,null,null,null,1.9488506373398244,4.8721265933495614E-3,null,null,null,null,null,null,null,null,1,1,1,1,1,1,1,1,null,1,4.8721265933495614E-3,null,null,null,{"$f":"CB$149*(H$16+($BW477*MMULT($AD477:$AH477,CC$3:CC$7)))","v":-2.0482718628937708},-1.2678658604275863,-0.94578356754203363,0,-0.93659091055329835,0.12895756749302487,0.28143159564186671,0.38837513349495462,0,0.39196179308831358,1.1907260897181597,0.10830162251970865,0.23635292622880252,0.32616664474604862,0,0.32917880650544024,119.64883767919288,261.11661346722661,360.3404919116989,0,363.66825049026812]
[null,null,null,null,null,null,null,null,null,null,null,null,null,null,null,null,null,null,null,null,null,null,null,null,null,null,null,null,370,-0.45220691209728869,0.45220691209728869,-6.5595650955370538E-2,6.5595650955370538E-2,-1.4804186264827487E-2,-1.0316725762335615,370,0,0,1,1,0,1,2.5000000000000001E-3,null,3,8.2990771230846954E-3,1.5511427802245863E-2,0.97618949497466945,0,0,1,null,null,null,null,1.9488506373398244,4.8721265933495614E-3,null,null,null,null,null,null,null,null,1,1,1,1,1,1,1,1,null,1,4.8721265933495614E-3,null,null,null,{"$f":"CB$149*(H$16+($BW478*MMULT($AD478:$AH478,CC$3:CC$7)))","v":-1.8522257013598393},-1.4639120219615178,-0.8879072196733464,0,-1.0316725762335615,0.15688759250650336,0.23132953606991763,0.41151606494094972,0,0.35641033829888635,1.156143531816257,0.13569906174196122,0.20008721210117211,0.35593856092804832,0,0.30827516522881848,149.91682150124791,221.05118838841739,393.23173660205782,0,340.57444705666353]
[null,null,null,null,null,null,null,null,null,null,null,null,null,null,null,null,null,null,null,null,null,null,null,null,null,null,null,null,371,-0.45545285913139361,0.45545285913139361,-3.4914728194197754E-2,3.4914728194197754E-2,-1.4804186264827485E-2,-1.0367166054510515,371,0,0,1,1,0,1,2.5000000000000001E-3,null,3,1.885145151437162E-3,1.1116715232836426E-2,0.98699813951572646,0,0,1,null,null,null,null,1.9488506373398244,4.8721265933495614E-3,null,null,null,null,null,null,null,null,1,1,1,1,1,1,1,1,null,1,4.8721265933495614E-3,null,null,null,{"$f":"CB$149*(H$16+($BW479*MMULT($AD479:$AH479,CC$3:CC$7)))","v":-1.8861525711551168},-1.4299851521662399,-0.86047224394627853,0,-1.0367166054510515,0.15165416644269056,0.23931247548922824,0.42296229376426009,0,0.3546171204626245,1.1685460561588035,0.12978022187777682,0.20479507352571652,0.36195603205799554,0,0.30346867253851106,143.37783996355157,226.25231219705597,399.87968341684592,0,335.26435797093291]
[null,null,null,null,null,null,null,null,null,null,null,null,null,null,null,null,null,null,null,null,null,null,null,null,null,null,null,null,374,-0.56225323027830187,0.56225323027830187,-2.4005635135927503E-2,2.4005635135927503E-2,-1.4804186264827488E-2,-0.94453008536454086,374,0,0,1,1,0,1,2.5000000000000001E-3,null,3,4.8294862710559633E-2,2.7418944210089021E-3,0.94896324276843147,0,0,1,null,null,null,null,1.9488506373398244,4.8721265933495614E-3,null,null,null,null,null,null,null,null,1,1,1,1,1,1,1,1,null,1,4.8721265933495614E-3,null,null,null,{"$f":"CB$149*(H$16+($BW480*MMULT($AD480:$AH480,CC$3:CC$7)))","v":-2.0038620353602958},-1.3122756879610618,-0.95636352203491648,0,-0.94453008536454086,0.13481362157354729,0.26920672826711556,0.38428780227194187,0,0.38886226004141217,1.177170412154017,0.11452345402299216,0.22868968289350231,0.32645044277723739,0,0.33033642030626809,126.52255656062688,252.65045999150522,360.6540246527361,0,364.94715234351816]
[null,null,null,null,null,null,null,null,null,null,null,null,null,null,null,null,null,null,null,null,null,null,null,null,null,null,null,null,375,-1.6185149121092928E-3,1.6185149121092928E-3,-1.2287182685955467,1.2287182685955467,-1.4804186264827487E-2,-1.1318169643975788,375,0,0,1,1,0,1,2.5000000000000001E-3,null,2,6.6726215059584667E-7,0.92718324539390107,7.2816087243948321E-2,0,1,0,null,null,null,null,1.9488506373398244,4.8721265933495614E-3,null,null,null,null,null,null,null,null,1,1,1,1,1,1,1,1,null,1,4.8721265933495614E-3,null,null,null,{"$f":"CB$149*(H$16+($BW481*MMULT($AD481:$AH481,CC$3:CC$7)))","v":-0.23851468653448382},-3.0776230367868731,-1.6004414401283431,0,-1.1318169643975788,0.78779711816263687,4.6068630048178544E-2,0.20180741243867084,0,0.32244684939777107,1.3581200100472572,0.58006443637865601,3.3920883064358601E-2,0.14859321042744134,0,0.23742147012954415,640.84021990632891,37.474916231875895,164.1619442167422,0,262.29711319343943]
[null,null,null,null,null,null,null,null,null,null,null,null,null,null,null,null,null,null,null,null,null,null,null,null,null,null,null,null,380,-0.36447707139307084,0.36447707139307084,-0.29607764896919286,0.29607764896919286,-1.4804186264827487E-2,-1.050131176434886,380,0,0,1,1,0,1,2.5000000000000001E-3,null,3,3.6245904163952369E-3,3.4670220100339662E-2,0.9617051893832651,0,0,1,null,null,null,null,1.9488506373398244,4.8721265933495614E-3,null,null,null,null,null,null,null,null,1,1,1,1,1,1,1,1,null,1,4.8721265933495614E-3,null,null,null,{"$f":"CB$149*(H$16+($BW482*MMULT($AD482:$AH482,CC$3:CC$7)))","v":-1.5340138626417992},-1.782123860679558,-1.0306593769829508,0,-1.050131176434886,0.21566826487204938,0.16828036341455838,0.35677163598892686,0,0.34989184853539768,1.0906121128109323,0.19774974286337993,0.15429900460286869,0.32712972082199543,0,0.32082153171175598,218.46881269629137,170.46555837545301,361.40447350682882,0,354.43534896981328]
[null,null,null,null,null,null,null,null,null,null,null,null,null,null,null,null,null,null,null,null,null,null,null,null,null,null,null,null,387,-0.43757897279968383,0.43757897279968383,-0.52871779175049571,0.52871779175049571,-1.4804186264827488E-2,-0.9249603178817567,387,0,0,1,1,0,1,2.5000000000000001E-3,null,3,7.8660615597221747E-2,0.10792671913556831,0.81341266516720989,0,0,1,null,null,null,null,1.9488506373398244,4.8721265933495614E-3,null,null,null,null,null,null,null,null,1,1,1,1,1,1,1,1,null,1,4.8721265933495614E-3,null,null,null,{"$f":"CB$149*(H$16+($BW483*MMULT($AD483:$AH483,CC$3:CC$7)))","v":-1.3744756212671096},-1.9416621020542482,-1.3364014211708668,0,-0.9249603178817567,0.25297221427973415,0.14346529753470688,0.26278963831584984,0,0.39654715459385909,1.0557743047241499,0.2396082317478167,0.13588633185403309,0.24890702221106892,0,0.37559841418708134,264.71299099674906,150.12371268828784,274.986054731764,0,414.95143513158558]
[null,null,null,null,null,null,null,null,null,null,null,null,null,null,null,null,null,null,null,null,null,null,null,null,null,null,null,null,389,-0.58051123837213148,0.58051123837213148,1.2885172614493826E-3,-1.2885172614493826E-3,-1.4804186264827485E-2,-0.93482722261701856,389,0,0,1,1,0,1,2.5000000000000001E-3,null,3,0.1174410139062638,4.0333198327920132E-4,0.88215565401045704,0,0,1,null,null,null,null,1.9488506373398244,4.8721265933495614E-3,null,null,null,null,null,null,null,null,1,1,1,1,1,1,1,1,null,1,4.8721265933495614E-3,null,null,null,{"$f":"CB$149*(H$16+($BW484*MMULT($AD484:$AH484,CC$3:CC$7)))","v":-2.047414195851502},-1.268723527469855,-0.94932737773136922,0,-0.93482722261701856,0.12906821759220366,0.28119032451756715,0.38700124158351323,0,0.39265370135003924,1.1899134850433233,0.10846857289587272,0.23631157059063782,0.32523477248383564,0,0.32998508402965382,119.83328014638215,261.07092482542447,359.3109834847225,0,364.55900509185733]
[null,null,null,null,null,null,null,null,null,null,null,null,null,null,null,null,null,null,null,null,null,null,null,null,null,null,null,null,395,-0.43509034163615284,0.43509034163615284,-0.24076660241429068,0.24076660241429068,-1.4804186264827487E-2,-1.001614369732579,395,0,0,1,1,0,1,2.5000000000000001E-3,null,3,2.3792689670451235E-2,3.1885530574338343E-2,0.94432177965521047,0,0,1,null,null,null,null,1.9488506373398244,4.8721265933495614E-3,null,null,null,null,null,null,null,null,1,1,1,1,1,1,1,1,null,1,4.8721265933495614E-3,null,null,null,{"$f":"CB$149*(H$16+($BW485*MMULT($AD485:$AH485,CC$3:CC$7)))","v":-1.6599381794397834},-1.6561995438815738,-1.0459616006711308,0,-1.001614369732579,0.19015073496313173,0.19086296982597775,0.35135379483688151,0,0.36728602686030765,1.0996535264862985,0.17291876976079606,0.17356646000657905,0.31951317971902971,0,0.33400159051359524,191.0361944118626,191.75174588081666,352.98991545217172,0,368.9963378035356]
[null,null,null,null,null,null,null,null,null,null,null,null,null,null,null,null,null,null,null,null,null,null,null,null,null,null,null,null,4,-6.1068174959339123E-5,6.1068174959339123E-5,-1.2328272011609893,1.2328272011609893,-1.4804186264827487E-2,-1.1321401983535906,4,0,0,1,0,1,1,2.5000000000000001E-3,null,2,6.3893149074190093E-8,0.99836843210584647,1.6315039010044142E-3,0,1,0,null,null,{"$f":"SUM($AQ$486:$AQ$553)","v":0.1700000000000001},{"$f":"Assumptions!S61","v":0.32209354631009818},{"$f":"$BC$486/$BB$486","v":1.8946679194711646},4.7366697986779118E-3,null,null,null,null,null,null,null,null,1,1,1,1,1,1,1,1,null,1,4.7366697986779118E-3,null,null,null,{"$f":"CB$149*(H$16+($BW486*MMULT($AD486:$AH486,CC$3:CC$7)))","v":-0.23284830723189121},-3.0832894160894657,-1.6029929259566358,0,-1.1321401983535906,0.79227374660711258,4.5808325903866194E-2,0.20129316001865541,0,0.32234264046987604,1.3617178729995101,0.58181930509727375,3.3640100355709052E-2,0.14782295511423299,0,0.23671763943278434,624.90815833947738,36.131446611464192,158.77054926063406,0,254.24866931783569]
[null,null,null,null,null,null,null,null,null,null,null,null,null,null,null,null,null,null,null,null,null,null,null,null,null,null,null,null,5,-1.3368448300055882E-5,1.3368448300055882E-5,-1.23295321801785,1.23295321801785,-1.4804186264827487E-2,-1.1321500532522617,5,0,0,1,0,1,1,2.5000000000000001E-3,null,2,8.9186973388289827E-8,0.99923147527330114,7.6843543972547341E-4,0,1,0,null,null,null,null,1.8946679194711646,4.7366697986779118E-3,null,null,null,null,null,null,null,null,1,1,1,1,1,1,1,1,null,1,4.7366697986779118E-3,null,null,null,{"$f":"CB$149*(H$16+($BW487*MMULT($AD487:$AH487,CC$3:CC$7)))","v":-0.23267459064837137},-3.0834631326729856,-1.6030712430868372,0,-1.1321500532522617,0.79241138965067903,4.5800368929142653E-2,0.2012773959333406,0,0.32233946383146961,1.361828618344632,0.58187306315672316,3.3631521846570679E-2,0.14779935832014085,0,0.23669605667656529,624.96589765756494,36.122232788031397,158.74520491573236,0,254.22548816808253]
[null,null,null,null,null,null,null,null,null,null,null,null,null,null,null,null,null,null,null,null,null,null,null,null,null,null,null,null,14,-1.0397783566571616E-3,1.0397783566571616E-3,-1.2304343429484448,1.2304343429484448,-1.4804186264827487E-2,-1.1318881585621612,14,0,0,1,0,1,1,2.5000000000000001E-3,null,2,7.5313557817342368E-5,0.9786204552233122,2.1304231118870413E-2,0,1,0,null,null,null,null,1.8946679194711646,4.7366697986779118E-3,null,null,null,null,null,null,null,null,1,1,1,1,1,1,1,1,null,1,4.7366697986779118E-3,null,null,null,{"$f":"CB$149*(H$16+($BW488*MMULT($AD488:$AH488,CC$3:CC$7)))","v":-0.23621987562613356},-3.0799178476952234,-1.6015787779257891,0,-1.1318881585621612,0.78960703950230271,4.5963032462997537E-2,0.20157801971393507,0,0.32242389388086512,1.3595719855601005,0.58077619124890223,3.3806987015889585E-2,0.14826579383429361,0,0.2371510279009145,623.78779270668826,36.310692701360445,159.24618409531564,0,254.7141540260468]
[null,null,null,null,null,null,null,null,null,null,null,null,null,null,null,null,null,null,null,null,null,null,null,null,null,null,null,null,15,-2.3950810514887068E-5,2.3950810514887068E-5,-1.2329249585479671,1.2329249585479671,-1.4804186264827487E-2,-1.132147945019778,15,0,0,1,0,1,1,2.5000000000000001E-3,null,2,2.7742531140982122E-9,0.99945079679103743,5.4920033470941124E-4,0,1,0,null,null,null,null,1.8946679194711646,4.7366697986779118E-3,null,null,null,null,null,null,null,null,1,1,1,1,1,1,1,1,null,1,4.7366697986779118E-3,null,null,null,{"$f":"CB$149*(H$16+($BW489*MMULT($AD489:$AH489,CC$3:CC$7)))","v":-0.23271343248046894},-3.0834242908408882,-1.6030535659791691,0,-1.132147945019778,0.79238061153827311,4.5802147933932273E-2,0.20128095396698745,0,0.32234014339871436,1.3618038568379072,0.58186104229295676,3.3633439723312529E-2,0.14780465847288721,0,0.23670085951084355,624.95298654277019,36.124292700468416,158.75089759155566,0,254.23064669461706]
[null,null,null,null,null,null,null,null,null,null,null,null,null,null,null,null,null,null,null,null,null,null,null,null,null,null,null,null,19,-5.2133823200750089E-3,5.2133823200750089E-3,-1.2203267401100957,1.2203267401100957,-1.4804186264827487E-2,-1.1307884196356786,19,0,0,1,0,1,1,2.5000000000000001E-3,null,2,5.1504615914478179E-4,0.91583702822641178,8.3647925514443486E-2,0,1,0,null,null,null,null,1.8946679194711646,4.7366697986779118E-3,null,null,null,null,null,null,null,null,1,1,1,1,1,1,1,1,null,1,4.7366697986779118E-3,null,null,null,{"$f":"CB$149*(H$16+($BW490*MMULT($AD490:$AH490,CC$3:CC$7)))","v":-0.25050108242790059},-3.0656366408934566,-1.5956447790508579,0,-1.1307884196356786,0.77841063743989591,4.6624149573570035E-2,0.20277773950365968,0,0.32277867103315994,1.3505911975502856,0.57634807545894284,3.452128938655704E-2,0.15013998304702397,0,0.23899065210747619,619.03173587087247,37.077895465243806,161.25917355621232,0,256.69001863708263]
[null,null,null,null,null,null,null,null,null,null,null,null,null,null,null,null,null,null,null,null,null,null,null,null,null,null,null,null,23,-8.319891013384444E-3,8.319891013384444E-3,-1.2110636593535726,1.2110636593535726,-1.4804186264827487E-2,-1.1304196164436537,23,0,0,1,0,1,1,2.5000000000000001E-3,null,2,1.6417742683432781E-5,0.93872016492526544,6.126341723205108E-2,0,1,0,null,null,null,null,1.8946679194711646,4.7366697986779118E-3,null,null,null,null,null,null,null,null,1,1,1,1,1,1,1,1,null,1,4.7366697986779118E-3,null,null,null,{"$f":"CB$149*(H$16+($BW491*MMULT($AD491:$AH491,CC$3:CC$7)))","v":-0.26287067187773294},-3.0532670514436244,-1.5894882069876441,0,-1.1304196164436537,0.76884132368642222,4.7204452819523485E-2,0.20403000614922678,0,0.32289773479155204,1.3429735174467246,0.57249179801263061,3.5149206001670895E-2,0.15192407258866189,0,0.24043492339703662,614.88986705368336,37.752314846147563,163.17539067037507,0,258.24125095920527]
[null,null,null,null,null,null,null,null,null,null,null,null,null,null,null,null,null,null,null,null,null,null,null,null,null,null,null,null,26,-1.2059416554840923E-2,1.2059416554840923E-2,-1.2035043306603666,1.2035043306603666,-1.4804186264827487E-2,-1.1290472500764099,26,0,0,1,0,1,1,2.5000000000000001E-3,null,2,1.1171225441315943E-3,0.87808188776990137,0.12080098958596708,0,1,0,null,null,null,null,1.8946679194711646,4.7366697986779118E-3,null,null,null,null,null,null,null,null,1,1,1,1,1,1,1,1,null,1,4.7366697986779118E-3,null,null,null,{"$f":"CB$149*(H$16+($BW492*MMULT($AD492:$AH492,CC$3:CC$7)))","v":-0.27416952611239553},-3.0419681972089618,-1.5856684038358946,0,-1.1290472500764099,0.76020319004504688,4.77408335888529E-2,0.20481085099713733,0,0.3233411729930788,1.3360960476241159,0.56897345920367171,3.5731588064905222E-2,0.15329051482588982,0,0.24200443790553328,611.11096421175512,38.377827439829652,164.64303001211297,0,259.92700186571352]
[null,null,null,null,null,null,null,null,null,null,null,null,null,null,null,null,null,null,null,null,null,null,null,null,null,null,null,null,28,-0.21245687393993781,0.21245687393993781,-0.87595411465091666,0.87595411465091666,-1.4804186264827487E-2,-1.0354563730289907,28,0,0,1,0,1,1,2.5000000000000001E-3,null,3,7.3133756790180166E-2,0.34119622474467282,0.58567001836514698,0,0,1,null,null,null,null,1.8946679194711646,4.7366697986779118E-3,null,null,null,null,null,null,null,null,1,1,1,1,1,1,1,1,null,1,4.7366697986779118E-3,null,null,null,{"$f":"CB$149*(H$16+($BW493*MMULT($AD493:$AH493,CC$3:CC$7)))","v":-0.80211719950694238},-2.5140205238144149,-1.4585156452115415,0,-1.0354563730289907,0.44837865141171751,8.0942154305046074E-2,0.23258125172699565,0,0.35506430217251006,1.1169663596162693,0.40142538542141659,7.2466062749511562E-2,0.20822583395161362,0,0.3178827178774582,431.15447720056716,77.83281410254888,223.64679424250062,0,341.4247379837945]
[null,null,null,null,null,null,null,null,null,null,null,null,null,null,null,null,null,null,null,null,null,null,null,null,null,null,null,null,30,-1.5751875389337974E-4,1.5751875389337974E-4,-1.2325767455158156,1.2325767455158156,-1.4804186264827487E-2,-1.1321191455461959,30,0,0,1,0,1,1,2.5000000000000001E-3,null,2,1.4683720178838063E-6,0.99516216691640658,4.8363646115755091E-3,0,1,0,null,null,null,null,1.8946679194711646,4.7366697986779118E-3,null,null,null,null,null,null,null,null,1,1,1,1,1,1,1,1,null,1,4.7366697986779118E-3,null,null,null,{"$f":"CB$149*(H$16+($BW494*MMULT($AD494:$AH494,CC$3:CC$7)))","v":-0.23319521345599892},-3.082942509865358,-1.6028389208903961,0,-1.1321191455461959,0.79199894958037276,4.5824219853933909E-2,0.20132416257231156,0,0.32234942675883593,1.3614967587654543,0.58171196110560175,3.3657237565137728E-2,0.14786973327418237,0,0.23676106805507807,624.79286457806927,36.149852982461731,158.82079175607615,0,254.29531421280399]
[null,null,null,null,null,null,null,null,null,null,null,null,null,null,null,null,null,null,null,null,null,null,null,null,null,null,null,null,32,-3.0342208997090353E-4,3.0342208997090353E-4,-1.2321886109978633,1.2321886109978633,-1.4804186264827488E-2,-1.1320896932194799,32,0,0,1,0,1,1,2.5000000000000001E-3,null,2,4.6447772088861647E-7,0.99319003843992204,6.8094969823570594E-3,0,1,0,null,null,null,null,1.8946679194711646,4.7366697986779118E-3,null,null,null,null,null,null,null,null,1,1,1,1,1,1,1,1,null,1,4.7366697986779118E-3,null,null,null,{"$f":"CB$149*(H$16+($BW495*MMULT($AD495:$AH495,CC$3:CC$7)))","v":-0.23372925131002908},-3.0824084720113287,-1.6025966897085213,0,-1.1320896932194799,0.79157610507847931,4.584869825758258E-2,0.20137293546907115,0,0.32235892083928019,1.3611566596444131,0.58154665700660035,3.3683630706813746E-2,0.1479425120115693,0,0.23682720027501672,624.61531825197119,36.178200769159524,158.89896040113192,0,254.36634410714873]
[null,null,null,null,null,null,null,null,null,null,null,null,null,null,null,null,null,null,null,null,null,null,null,null,null,null,null,null,35,-7.1816034271150178E-4,7.1816034271150178E-4,-1.2310954868445521,1.2310954868445521,-1.4804186264827487E-2,-1.1320033443622011,35,0,0,1,0,1,1,2.5000000000000001E-3,null,2,1.0471475712215012E-6,0.98977735731753069,1.0221595434898091E-2,0,1,0,null,null,null,null,1.8946679194711646,4.7366697986779118E-3,null,null,null,null,null,null,null,null,1,1,1,1,1,1,1,1,null,1,4.7366697986779118E-3,null,null,null,{"$f":"CB$149*(H$16+($BW496*MMULT($AD496:$AH496,CC$3:CC$7)))","v":-0.23523711371608069},-3.0809006096052762,-1.6019183038079507,0,-1.1320033443622011,0.79038341665909717,4.5917883934183369E-2,0.20150959037639027,0,0.32238675736553718,1.3601976483352081,0.58107982882228493,3.3758243877559872E-2,0.14814728625874679,0,0.23701464104140837,624.11391732153504,36.258339703550902,159.11889998814451,0,254.56766651618079]
[null,null,null,null,null,null,null,null,null,null,null,null,null,null,null,null,null,null,null,null,null,null,null,null,null,null,null,null,36,-1.5751875389338028E-4,1.5751875389338028E-4,-1.2325767455158156,1.2325767455158156,-1.4804186264827487E-2,-1.1321191455461959,36,0,0,1,0,1,1,2.5000000000000001E-3,null,2,1.468372017883809E-6,0.99516216691640658,4.8363646115755091E-3,0,1,0,null,null,null,null,1.8946679194711646,4.7366697986779118E-3,null,null,null,null,null,null,null,null,1,1,1,1,1,1,1,1,null,1,4.7366697986779118E-3,null,null,null,{"$f":"CB$149*(H$16+($BW497*MMULT($AD497:$AH497,CC$3:CC$7)))","v":-0.23319521345599892},-3.082942509865358,-1.6028389208903961,0,-1.1321191455461959,0.79199894958037276,4.5824219853933909E-2,0.20132416257231156,0,0.32234942675883593,1.3614967587654543,0.58171196110560175,3.3657237565137728E-2,0.14786973327418237,0,0.23676106805507807,624.79286457806927,36.149852982461731,158.82079175607615,0,254.29531421280399]
[null,null,null,null,null,null,null,null,null,null,null,null,null,null,null,null,null,null,null,null,null,null,null,null,null,null,null,null,42,-1.1900515330930926E-4,1.1900515330930926E-4,-1.2326741485242485,1.2326741485242485,-1.4804186264827487E-2,-1.1321282258788887,42,0,0,1,0,1,1,2.5000000000000001E-3,null,2,2.0237350079504432E-8,0.99769983751099311,2.3001421516568566E-3,0,1,0,null,null,null,null,1.8946679194711646,4.7366697986779118E-3,null,null,null,null,null,null,null,null,1,1,1,1,1,1,1,1,null,1,4.7366697986779118E-3,null,null,null,{"$f":"CB$149*(H$16+($BW498*MMULT($AD498:$AH498,CC$3:CC$7)))","v":-0.23305929684698201},-3.0830784264743754,-1.602897810298245,0,-1.1321282258788887,0.79210660270770294,4.5817992004604166E-2,0.20131230706067749,0,0.32234649973208684,1.3615834015050714,0.58175400921612408,3.3650521851219493E-2,0.14785161660912599,0,0.2367438523235304,624.83802672218849,36.142639910671555,158.8013333921194,0,254.27682350443172]
[null,null,null,null,null,null,null,null,null,null,null,null,null,null,null,null,null,null,null,null,null,null,null,null,null,null,null,null,44,-6.1068174959339028E-5,6.1068174959339028E-5,-1.2328272011609893,1.2328272011609893,-1.4804186264827487E-2,-1.1321401983535906,44,0,0,1,0,1,1,2.5000000000000001E-3,null,2,6.3893149074190199E-8,0.99836843210584647,1.6315039010044113E-3,0,1,0,null,null,null,null,1.8946679194711646,4.7366697986779118E-3,null,null,null,null,null,null,null,null,1,1,1,1,1,1,1,1,null,1,4.7366697986779118E-3,null,null,null,{"$f":"CB$149*(H$16+($BW499*MMULT($AD499:$AH499,CC$3:CC$7)))","v":-0.23284830723189121},-3.0832894160894657,-1.6029929259566358,0,-1.1321401983535906,0.79227374660711258,4.5808325903866194E-2,0.20129316001865541,0,0.32234264046987604,1.3617178729995101,0.58181930509727375,3.3640100355709052E-2,0.14782295511423299,0,0.23671763943278434,624.90815833947738,36.131446611464192,158.77054926063406,0,254.24866931783569]
[null,null,null,null,null,null,null,null,null,null,null,null,null,null,null,null,null,null,null,null,null,null,null,null,null,null,null,null,45,-2.3950810514887109E-5,2.3950810514887109E-5,-1.2329249585479671,1.2329249585479671,-1.4804186264827487E-2,-1.132147945019778,45,0,0,1,0,1,1,2.5000000000000001E-3,null,2,2.7742531140982122E-9,0.99945079679103743,5.4920033470941222E-4,0,1,0,null,null,null,null,1.8946679194711646,4.7366697986779118E-3,null,null,null,null,null,null,null,null,1,1,1,1,1,1,1,1,null,1,4.7366697986779118E-3,null,null,null,{"$f":"CB$149*(H$16+($BW500*MMULT($AD500:$AH500,CC$3:CC$7)))","v":-0.23271343248046894},-3.0834242908408882,-1.6030535659791691,0,-1.132147945019778,0.79238061153827311,4.5802147933932273E-2,0.20128095396698745,0,0.32234014339871436,1.3618038568379072,0.58186104229295676,3.3633439723312529E-2,0.14780465847288721,0,0.23670085951084355,624.95298654277019,36.124292700468416,158.75089759155566,0,254.23064669461706]
[null,null,null,null,null,null,null,null,null,null,null,null,null,null,null,null,null,null,null,null,null,null,null,null,null,null,null,null,49,-1.8500603386518619E-3,1.8500603386518619E-3,-1.2281595374552723,1.2281595374552723,-1.4804186264827487E-2,-1.1317554292980252,49,0,0,1,0,1,1,2.5000000000000001E-3,null,2,2.3664728474596488E-5,0.97018009708542297,2.9796238086102406E-2,0,1,0,null,null,null,null,1.8946679194711646,4.7366697986779118E-3,null,null,null,null,null,null,null,null,1,1,1,1,1,1,1,1,null,1,4.7366697986779118E-3,null,null,null,{"$f":"CB$149*(H$16+($BW501*MMULT($AD501:$AH501,CC$3:CC$7)))","v":-0.23930496310130067},-3.0768327602200563,-1.6001142544146112,0,-1.1317554292980252,0.78717478650020101,4.6105051396544507E-2,0.20187345174391547,0,0.32246669180724563,1.3576199814479066,0.57981968242738757,3.3960203905789084E-2,0.14869658262440769,0,0.23752353104241566,622.76044596715667,36.475256653870737,159.70887659641519,0,255.11424431196855]
[null,null,null,null,null,null,null,null,null,null,null,null,null,null,null,null,null,null,null,null,null,null,null,null,null,null,null,null,50,-4.435837052110264E-4,4.435837052110264E-4,-1.2319055046165377,1.2319055046165377,-1.4804186264827487E-2,-1.1320381970287789,50,0,0,1,0,1,1,2.5000000000000001E-3,null,2,3.3533169792860292E-5,0.98572001683948496,1.4246449890722141E-2,0,1,0,null,null,null,null,1.8946679194711646,4.7366697986779118E-3,null,null,null,null,null,null,null,null,1,1,1,1,1,1,1,1,null,1,4.7366697986779118E-3,null,null,null,{"$f":"CB$149*(H$16+($BW502*MMULT($AD502:$AH502,CC$3:CC$7)))","v":-0.23415251930659453},-3.0819852040147628,-1.6024537449424359,0,-1.1320381970287789,0.79124112714407435,4.5868108651848781E-2,0.2014017227336731,0,0.32237552152317422,1.3608864800527705,0.58141596580002231,3.3704581039022574E-2,0.14799303666082672,0,0.23688641650012837,624.47494820838835,36.200702658324282,158.95322684647257,0,254.429945816226]
[null,null,null,null,null,null,null,null,null,null,null,null,null,null,null,null,null,null,null,null,null,null,null,null,null,null,null,null,54,-6.1068174959339028E-5,6.1068174959339028E-5,-1.2328272011609893,1.2328272011609893,-1.4804186264827487E-2,-1.1321401983535906,54,0,0,1,0,1,1,2.5000000000000001E-3,null,2,6.3893149074189974E-8,0.99836843210584647,1.6315039010044142E-3,0,1,0,null,null,null,null,1.8946679194711646,4.7366697986779118E-3,null,null,null,null,null,null,null,null,1,1,1,1,1,1,1,1,null,1,4.7366697986779118E-3,null,null,null,{"$f":"CB$149*(H$16+($BW503*MMULT($AD503:$AH503,CC$3:CC$7)))","v":-0.23284830723189121},-3.0832894160894657,-1.6029929259566358,0,-1.1321401983535906,0.79227374660711258,4.5808325903866194E-2,0.20129316001865541,0,0.32234264046987604,1.3617178729995101,0.58181930509727375,3.3640100355709052E-2,0.14782295511423299,0,0.23671763943278434,624.90815833947738,36.131446611464192,158.77054926063406,0,254.24866931783569]
[null,null,null,null,null,null,null,null,null,null,null,null,null,null,null,null,null,null,null,null,null,null,null,null,null,null,null,null,57,-8.7892731218491631E-5,8.7892731218491631E-5,-1.2327713462526786,1.2327713462526786,-1.4804186264827487E-2,-1.1321307753928995,57,0,0,1,0,1,1,2.5000000000000001E-3,null,2,4.6393425330929151E-6,0.99656237351452204,3.4329870429448306E-3,0,1,0,null,null,null,null,1.8946679194711646,4.7366697986779118E-3,null,null,null,null,null,null,null,null,1,1,1,1,1,1,1,1,null,1,4.7366697986779118E-3,null,null,null,{"$f":"CB$149*(H$16+($BW504*MMULT($AD504:$AH504,CC$3:CC$7)))","v":-0.23293098669646106},-3.0832067366248959,-1.6029638956045842,0,-1.1321307753928995,0.79220824454582528,4.5812113468299512E-2,0.20129900371477821,0,0.32234567790621704,1.36166503963512,0.5817937756249586,3.3644187178790759E-2,0.1478329823087178,0,0.23672905488753296,624.88073818447731,36.135836099855304,158.78131905734568,0,254.26093018773307]
[null,null,null,null,null,null,null,null,null,null,null,null,null,null,null,null,null,null,null,null,null,null,null,null,null,null,null,null,61,-3.0342208997090353E-4,3.0342208997090353E-4,-1.2321886109978633,1.2321886109978633,-1.4804186264827488E-2,-1.1320896932194799,61,0,0,1,0,1,1,2.5000000000000001E-3,null,2,4.6447772088861721E-7,0.99319003843992204,6.8094969823570715E-3,0,1,0,null,null,null,null,1.8946679194711646,4.7366697986779118E-3,null,null,null,null,null,null,null,null,1,1,1,1,1,1,1,1,null,1,4.7366697986779118E-3,null,null,null,{"$f":"CB$149*(H$16+($BW505*MMULT($AD505:$AH505,CC$3:CC$7)))","v":-0.23372925131002908},-3.0824084720113287,-1.6025966897085213,0,-1.1320896932194799,0.79157610507847931,4.584869825758258E-2,0.20137293546907115,0,0.32235892083928019,1.3611566596444131,0.58154665700660035,3.3683630706813746E-2,0.1479425120115693,0,0.23682720027501672,624.61531825197119,36.178200769159524,158.89896040113192,0,254.36634410714873]
[null,null,null,null,null,null,null,null,null,null,null,null,null,null,null,null,null,null,null,null,null,null,null,null,null,null,null,null,66,-6.1068174959339028E-5,6.1068174959339028E-5,-1.2328272011609893,1.2328272011609893,-1.4804186264827487E-2,-1.1321401983535906,66,0,0,1,0,1,1,2.5000000000000001E-3,null,2,6.3893149074190027E-8,0.99836843210584647,1.6315039010044126E-3,0,1,0,null,null,null,null,1.8946679194711646,4.7366697986779118E-3,null,null,null,null,null,null,null,null,1,1,1,1,1,1,1,1,null,1,4.7366697986779118E-3,null,null,null,{"$f":"CB$149*(H$16+($BW506*MMULT($AD506:$AH506,CC$3:CC$7)))","v":-0.23284830723189121},-3.0832894160894657,-1.6029929259566358,0,-1.1321401983535906,0.79227374660711258,4.5808325903866194E-2,0.20129316001865541,0,0.32234264046987604,1.3617178729995101,0.58181930509727375,3.3640100355709052E-2,0.14782295511423299,0,0.23671763943278434,624.90815833947738,36.131446611464192,158.77054926063406,0,254.24866931783569]
[null,null,null,null,null,null,null,null,null,null,null,null,null,null,null,null,null,null,null,null,null,null,null,null,null,null,null,null,68,-7.4866896766165582E-5,7.4866896766165582E-5,-1.2327921752768665,1.2327921752768665,-1.4804186264827487E-2,-1.1321369781671908,68,0,0,1,0,1,1,2.5000000000000001E-3,null,2,4.5598832601208712E-7,0.9982578132724278,1.7417306392461976E-3,0,1,0,null,null,null,null,1.8946679194711646,4.7366697986779118E-3,null,null,null,null,null,null,null,null,1,1,1,1,1,1,1,1,null,1,4.7366697986779118E-3,null,null,null,{"$f":"CB$149*(H$16+($BW507*MMULT($AD507:$AH507,CC$3:CC$7)))","v":-0.23289713183782079},-3.0832405914835364,-1.6029716987943197,0,-1.1321369781671908,0.79223506509795849,4.5810562531927536E-2,0.20129743294658717,0,0.32234367847493423,1.3616867390514074,0.58180420090589535,3.3642512053719917E-2,0.14782947294237228,0,0.23672381409801252,624.89193554945518,36.13403691699245,158.77754979145729,0,254.25530127150637]
[null,null,null,null,null,null,null,null,null,null,null,null,null,null,null,null,null,null,null,null,null,null,null,null,null,null,null,null,71,-2.3659819957246937E-2,2.3659819957246937E-2,-1.1925208009203858,1.1925208009203858,-1.4804186264827488E-2,-1.1215672742925133,71,0,0,1,0,1,1,2.5000000000000001E-3,null,2,1.0093525614195145E-2,0.77845971985121976,0.21144675443458513,0,1,0,null,null,null,null,1.8946679194711646,4.7366697986779118E-3,null,null,null,null,null,null,null,null,1,1,1,1,1,1,1,1,null,1,4.7366697986779118E-3,null,null,null,{"$f":"CB$149*(H$16+($BW508*MMULT($AD508:$AH508,CC$3:CC$7)))","v":-0.29675345925478247},-3.0193842640665753,-1.5862852774983198,0,-1.1215672742925133,0.7432272255703094,4.8831276278673383E-2,0.20468454753802223,0,0.32576882520796774,1.3225118745949727,0.56198151400185148,3.692312879506527E-2,0.15476953475424038,0,0.24632582244884299,603.6012037741059,39.657612274652735,166.23158441633373,0,264.56842306431895]
[null,null,null,null,null,null,null,null,null,null,null,null,null,null,null,null,null,null,null,null,null,null,null,null,null,null,null,null,76,-4.6743855481970443E-5,4.6743855481970443E-5,-1.2328647977483314,1.2328647977483314,-1.4804186264827487E-2,-1.1321432215272897,76,0,0,1,0,1,1,2.5000000000000001E-3,null,2,8.7910025946572509E-10,0.99922537612659557,7.7462289430414505E-4,0,1,0,null,null,null,null,1.8946679194711646,4.7366697986779118E-3,null,null,null,null,null,null,null,null,1,1,1,1,1,1,1,1,null,1,4.7366697986779118E-3,null,null,null,{"$f":"CB$149*(H$16+($BW509*MMULT($AD509:$AH509,CC$3:CC$7)))","v":-0.23279638632507171},-3.0833413369962854,-1.6030161982245004,0,-1.1321432215272897,0.7923148832464022,4.5805947555788901E-2,0.20128847552482576,0,0.32234166597355629,1.3617509723005732,0.58183537178449551,3.3637536148333556E-2,0.14781592201455485,0,0.2367111700526161,624.9254149066528,36.128692501907182,158.76299529786797,0,254.24172082298324]
[null,null,null,null,null,null,null,null,null,null,null,null,null,null,null,null,null,null,null,null,null,null,null,null,null,null,null,null,80,-2.4351537982519552E-3,2.4351537982519552E-3,-1.2269722048433231,1.2269722048433231,-1.4804186264827487E-2,-1.1315418915572346,80,0,0,1,0,1,1,2.5000000000000001E-3,null,2,1.6854319220859044E-4,0.96808724333018092,3.1744213377610492E-2,0,1,0,null,null,null,null,1.8946679194711646,4.7366697986779118E-3,null,null,null,null,null,null,null,null,1,1,1,1,1,1,1,1,null,1,4.7366697986779118E-3,null,null,null,{"$f":"CB$149*(H$16+($BW510*MMULT($AD510:$AH510,CC$3:CC$7)))","v":-0.24107738917284993},-3.0750603341485072,-1.5995120152622622,0,-1.1315418915572346,0.78578081310806336,4.6186841653850105E-2,0.20199506445666834,0,0.3225355579685949,1.3564982771871767,0.5792715157275774,3.4048581137620569E-2,0.14890919351222737,0,0.2377707096225746,622.1716826864606,36.570178999518454,159.93723319645636,0,255.37972864697571]
[null,null,null,null,null,null,null,null,null,null,null,null,null,null,null,null,null,null,null,null,null,null,null,null,null,null,null,null,81,-5.1862512269568699E-6,5.1862512269568699E-6,-1.2329744868075283,1.2329744868075283,-1.4804186264827487E-2,-1.1321518335717355,81,0,0,1,0,1,1,2.5000000000000001E-3,null,2,3.8702965173097166E-9,0.99974147189863927,2.5852413106423379E-4,0,1,0,null,null,null,null,1.8946679194711646,4.7366697986779118E-3,null,null,null,null,null,null,null,null,1,1,1,1,1,1,1,1,null,1,4.7366697986779118E-3,null,null,null,{"$f":"CB$149*(H$16+($BW511*MMULT($AD511:$AH511,CC$3:CC$7)))","v":-0.23264513966161982},-3.0834925836597371,-1.6030843296794424,0,-1.1321518335717355,0.79243472729167408,4.5799020082946632E-2,0.20127476191529459,0,0.32233888996475579,1.3618473992546711,0.58188217543710674,3.3630067589079431E-2,0.14779538590406735,0,0.23669237106974647,624.9756847827133,36.120670829941233,158.74093830719789,0,254.22152960955873]
[null,null,null,null,null,null,null,null,null,null,null,null,null,null,null,null,null,null,null,null,null,null,null,null,null,null,null,null,84,-6.658789342953484E-5,6.658789342953484E-5,-1.2328144103963725,1.2328144103963725,-1.4804186264827487E-2,-1.1321385947903435,84,0,0,1,0,1,1,2.5000000000000001E-3,null,2,6.5013738196454087E-7,0.99678326549765772,3.2160842649602639E-3,0,1,0,null,null,null,null,1.8946679194711646,4.7366697986779118E-3,null,null,null,null,null,null,null,null,1,1,1,1,1,1,1,1,null,1,4.7366697986779118E-3,null,null,null,{"$f":"CB$149*(H$16+($BW512*MMULT($AD512:$AH512,CC$3:CC$7)))","v":-0.2328666177149783},-3.0832711056063786,-1.6029856549104893,0,-1.1321385947903435,0.79225923982488844,4.580916468412212E-2,0.20129462363583189,0,0.32234315736710173,1.3617061855119443,0.58181364545027181,3.3641005065200465E-2,0.14782529871534186,0,0.23672005076918576,624.90207954567688,36.13241832267618,158.77306642608386,0,254.25125923497416]
[null,null,null,null,null,null,null,null,null,null,null,null,null,null,null,null,null,null,null,null,null,null,null,null,null,null,null,null,85,-1.3368448300055882E-5,1.3368448300055882E-5,-1.23295321801785,1.23295321801785,-1.4804186264827487E-2,-1.1321500532522617,85,0,0,1,0,1,1,2.5000000000000001E-3,null,2,8.9186973388289827E-8,0.99923147527330114,7.6843543972547341E-4,0,1,0,null,null,null,null,1.8946679194711646,4.7366697986779118E-3,null,null,null,null,null,null,null,null,1,1,1,1,1,1,1,1,null,1,4.7366697986779118E-3,null,null,null,{"$f":"CB$149*(H$16+($BW513*MMULT($AD513:$AH513,CC$3:CC$7)))","v":-0.23267459064837137},-3.0834631326729856,-1.6030712430868372,0,-1.1321500532522617,0.79241138965067903,4.5800368929142653E-2,0.2012773959333406,0,0.32233946383146961,1.361828618344632,0.58187306315672316,3.3631521846570679E-2,0.14779935832014085,0,0.23669605667656529,624.96589765756494,36.122232788031397,158.74520491573236,0,254.22548816808253]
[null,null,null,null,null,null,null,null,null,null,null,null,null,null,null,null,null,null,null,null,null,null,null,null,null,null,null,null,88,-5.1862512269568699E-6,5.1862512269568699E-6,-1.2329744868075283,1.2329744868075283,-1.4804186264827487E-2,-1.1321518335717355,88,0,0,1,0,1,1,2.5000000000000001E-3,null,2,3.8702965173097299E-9,0.99974147189863927,2.5852413106423422E-4,0,1,0,null,null,null,null,1.8946679194711646,4.7366697986779118E-3,null,null,null,null,null,null,null,null,1,1,1,1,1,1,1,1,null,1,4.7366697986779118E-3,null,null,null,{"$f":"CB$149*(H$16+($BW514*MMULT($AD514:$AH514,CC$3:CC$7)))","v":-0.23264513966161982},-3.0834925836597371,-1.6030843296794424,0,-1.1321518335717355,0.79243472729167408,4.5799020082946632E-2,0.20127476191529459,0,0.32233888996475579,1.3618473992546711,0.58188217543710674,3.3630067589079431E-2,0.14779538590406735,0,0.23669237106974647,624.9756847827133,36.120670829941233,158.74093830719789,0,254.22152960955873]
[null,null,null,null,null,null,null,null,null,null,null,null,null,null,null,null,null,null,null,null,null,null,null,null,null,null,null,null,91,-5.1862512269568699E-6,5.1862512269568699E-6,-1.2329744868075283,1.2329744868075283,-1.4804186264827487E-2,-1.1321518335717355,91,0,0,1,0,1,1,2.5000000000000001E-3,null,2,3.8702965173097199E-9,0.99974147189863927,2.58524131064234E-4,0,1,0,null,null,null,null,1.8946679194711646,4.7366697986779118E-3,null,null,null,null,null,null,null,null,1,1,1,1,1,1,1,1,null,1,4.7366697986779118E-3,null,null,null,{"$f":"CB$149*(H$16+($BW515*MMULT($AD515:$AH515,CC$3:CC$7)))","v":-0.23264513966161982},-3.0834925836597371,-1.6030843296794424,0,-1.1321518335717355,0.79243472729167408,4.5799020082946632E-2,0.20127476191529459,0,0.32233888996475579,1.3618473992546711,0.58188217543710674,3.3630067589079431E-2,0.14779538590406735,0,0.23669237106974647,624.9756847827133,36.120670829941233,158.74093830719789,0,254.22152960955873]
[null,null,null,null,null,null,null,null,null,null,null,null,null,null,null,null,null,null,null,null,null,null,null,null,null,null,null,null,92,-4.4358370521102505E-4,4.4358370521102505E-4,-1.2319055046165377,1.2319055046165377,-1.4804186264827487E-2,-1.1320381970287789,92,0,0,1,0,1,1,2.5000000000000001E-3,null,2,3.3533169792860238E-5,0.98572001683948496,1.4246449890722167E-2,0,1,0,null,null,null,null,1.8946679194711646,4.7366697986779118E-3,null,null,null,null,null,null,null,null,1,1,1,1,1,1,1,1,null,1,4.7366697986779118E-3,null,null,null,{"$f":"CB$149*(H$16+($BW516*MMULT($AD516:$AH516,CC$3:CC$7)))","v":-0.23415251930659453},-3.0819852040147628,-1.6024537449424359,0,-1.1320381970287789,0.79124112714407435,4.5868108651848781E-2,0.2014017227336731,0,0.32237552152317422,1.3608864800527705,0.58141596580002231,3.3704581039022574E-2,0.14799303666082672,0,0.23688641650012837,624.47494820838835,36.200702658324282,158.95322684647257,0,254.429945816226]
[null,null,null,null,null,null,null,null,null,null,null,null,null,null,null,null,null,null,null,null,null,null,null,null,null,null,null,null,94,-1.0108793229351741E-5,1.0108793229351741E-5,-1.2329614837106224,1.2329614837106224,-1.4804186264827487E-2,-1.1321508161319003,94,0,0,1,0,1,1,2.5000000000000001E-3,null,2,1.2265589129022795E-9,0.9996353182336245,3.6468043981658618E-4,0,1,0,null,null,null,null,1.8946679194711646,4.7366697986779118E-3,null,null,null,null,null,null,null,null,1,1,1,1,1,1,1,1,null,1,4.7366697986779118E-3,null,null,null,{"$f":"CB$149*(H$16+($BW517*MMULT($AD517:$AH517,CC$3:CC$7)))","v":-0.23266306530052816},-3.0834746580208288,-1.6030762491245389,0,-1.1321508161319003,0.79242052252020934,4.5799841067001301E-2,0.2012763883336301,0,0.32233921792534975,1.3618359698461904,0.58187662836494736,3.3630952685273885E-2,0.14779782058213869,0,0.23669459836764017,624.96972690091582,36.121621475318562,158.74355329466289,0,254.2239218585141]
[null,null,null,null,null,null,null,null,null,null,null,null,null,null,null,null,null,null,null,null,null,null,null,null,null,null,null,null,118,-1.5035588380755529,1.5035588380755529,3.3048189503482234E-2,-3.3048189503482234E-2,-1.4804186264827487E-2,-0.12191960190111457,118,0,0,1,0,1,1,2.5000000000000001E-3,null,1,0.997091385871261,4.4864447304586804E-6,2.9041275840085562E-3,1,0,0,null,null,null,null,{"$f":"$BC$486/$BB$486","v":1.8946679194711646},4.7366697986779118E-3,null,null,null,null,null,null,null,null,1,1,1,1,1,1,1,1,null,1,4.7366697986779118E-3,null,null,null,{"$f":"CB$149*(H$16+($BW518*MMULT($AD518:$AH518,CC$3:CC$7)))","v":-3.0022214677969563},-0.31391625552440083,-1.8406153051927578,0,-0.12191960190111457,4.9676590755442181E-2,0.73058020765403986,0.15871973497794831,0,0.88521953560949795,1.8241960689969283,2.7232045721246333E-2,0.40049434382114657,8.70080457224226E-2,0,0.48526556473518445,29.248818989660972,430.1544837547242,93.451759226218428,0,521.20376155880751]
[null,null,null,null,null,null,null,null,null,null,null,null,null,null,null,null,null,null,null,null,null,null,null,null,null,null,null,null,131,-1.504496629539037,1.504496629539037,3.3096913214701214E-2,-3.3096913214701214E-2,-1.4804186264827487E-2,-0.12109796403017323,131,0,0,1,0,1,1,2.5000000000000001E-3,null,1,0.9983299439133736,6.1471296906548237E-7,1.6694412736573392E-3,1,0,0,null,null,null,null,1.8946679194711646,4.7366697986779118E-3,null,null,null,null,null,null,null,null,1,1,1,1,1,1,1,1,null,1,4.7366697986779118E-3,null,null,null,{"$f":"CB$149*(H$16+($BW519*MMULT($AD519:$AH519,CC$3:CC$7)))","v":-3.0032079829716594},-0.31292974034969778,-1.8415043729450229,0,-0.12109796403017323,4.9627608209819235E-2,0.73130129173694269,0.15857868509067544,0,0.88594716438679699,1.8254547494242344,2.718643572264514E-2,0.40061321266254452,8.6870783918742797E-2,0,0.48532956769606755,29.199831168222197,430.28215588267039,93.304331974842583,0,521.27250450367603]
[null,null,null,null,null,null,null,null,null,null,null,null,null,null,null,null,null,null,null,null,null,null,null,null,null,null,null,null,153,-1.473771589209532,1.473771589209532,3.2107002870192337E-2,-3.2107002870192337E-2,-1.4804186264827487E-2,-0.14817421546018686,153,0,0,1,0,1,1,2.5000000000000001E-3,null,1,0.99260980054406034,1.9283530424496552E-6,7.3882710028971947E-3,1,0,0,null,null,null,null,1.8946679194711646,4.7366697986779118E-3,null,null,null,null,null,null,null,null,1,1,1,1,1,1,1,1,null,1,4.7366697986779118E-3,null,null,null,{"$f":"CB$149*(H$16+($BW520*MMULT($AD520:$AH520,CC$3:CC$7)))","v":-2.9714930322976456},-0.34464469102371154,-1.8117692429600267,0,-0.14817421546018686,5.1226769985440408E-2,0.70847203522632352,0.16336484885907673,0,0.86228087919555119,1.7853445332663918,2.8692932389760114E-2,0.39682650716729317,9.1503262151978723E-2,0,0.48297729829096803,30.817897206154687,426.21501143338838,98.279886096057567,0,518.74602879381064]
[null,null,null,null,null,null,null,null,null,null,null,null,null,null,null,null,null,null,null,null,null,null,null,null,null,null,null,null,155,-1.5039896523744078,1.5039896523744078,3.3082839053840941E-2,-3.3082839053840941E-2,-1.4804186264827487E-2,-0.12154531871464484,155,0,0,1,0,1,1,2.5000000000000001E-3,null,1,0.99888755001303753,2.7187985878467071E-7,1.1121780071036366E-3,1,0,0,null,null,null,null,1.8946679194711646,4.7366697986779118E-3,null,null,null,null,null,null,null,null,1,1,1,1,1,1,1,1,null,1,4.7366697986779118E-3,null,null,null,{"$f":"CB$149*(H$16+($BW521*MMULT($AD521:$AH521,CC$3:CC$7)))","v":-3.0026869316461697},-0.31345079167518719,-1.8410114699412541,0,-0.12154531871464484,4.9653473478839007E-2,0.73092034548444462,0.15865686826766884,0,0.88555092041002215,1.8247816076409746,2.7210638944914396E-2,0.40055223179795063,8.6945674815725418E-2,0,0.48529145444140959,29.225826852658333,430.21665884698689,93.3847692035488,0,521.23156862621727]
[null,null,null,null,null,null,null,null,null,null,null,null,null,null,null,null,null,null,null,null,null,null,null,null,null,null,null,null,170,-1.5044966295390372,1.5044966295390372,3.3096913214701214E-2,-3.3096913214701214E-2,-1.4804186264827487E-2,-0.12109796403017324,170,0,0,1,0,1,1,2.5000000000000001E-3,null,1,0.9983299439133736,6.1471296906548078E-7,1.6694412736573377E-3,1,0,0,null,null,null,null,1.8946679194711646,4.7366697986779118E-3,null,null,null,null,null,null,null,null,1,1,1,1,1,1,1,1,null,1,4.7366697986779118E-3,null,null,null,{"$f":"CB$149*(H$16+($BW522*MMULT($AD522:$AH522,CC$3:CC$7)))","v":-3.0032079829716594},-0.31292974034969756,-1.8415043729450231,0,-0.12109796403017324,4.9627608209819235E-2,0.7313012917369428,0.15857868509067541,0,0.88594716438679699,1.8254547494242344,2.718643572264514E-2,0.40061321266254457,8.6870783918742783E-2,0,0.48532956769606755,29.199831168222197,430.28215588267045,93.304331974842569,0,521.27250450367603]
[null,null,null,null,null,null,null,null,null,null,null,null,null,null,null,null,null,null,null,null,null,null,null,null,null,null,null,null,172,-1.5044966295390372,1.5044966295390372,3.3096913214701214E-2,-3.3096913214701214E-2,-1.4804186264827487E-2,-0.12109796403017324,172,0,0,1,0,1,1,2.5000000000000001E-3,null,1,0.9983299439133736,6.1471296906548353E-7,1.6694412736573392E-3,1,0,0,null,null,null,null,1.8946679194711646,4.7366697986779118E-3,null,null,null,null,null,null,null,null,1,1,1,1,1,1,1,1,null,1,4.7366697986779118E-3,null,null,null,{"$f":"CB$149*(H$16+($BW523*MMULT($AD523:$AH523,CC$3:CC$7)))","v":-3.0032079829716594},-0.31292974034969756,-1.8415043729450231,0,-0.12109796403017324,4.9627608209819235E-2,0.7313012917369428,0.15857868509067541,0,0.88594716438679699,1.8254547494242344,2.718643572264514E-2,0.40061321266254457,8.6870783918742783E-2,0,0.48532956769606755,29.199831168222197,430.28215588267045,93.304331974842569,0,521.27250450367603]
[null,null,null,null,null,null,null,null,null,null,null,null,null,null,null,null,null,null,null,null,null,null,null,null,null,null,null,null,178,-1.5028019030522222,1.5028019030522222,3.2761150338487963E-2,-3.2761150338487963E-2,-1.4804186264827487E-2,-0.12251874624405128,178,0,0,1,0,1,1,2.5000000000000001E-3,null,1,0.99236525322240421,7.3815204836066278E-5,7.5609314727597722E-3,1,0,0,null,null,null,null,1.8946679194711646,4.7366697986779118E-3,null,null,null,null,null,null,null,null,1,1,1,1,1,1,1,1,null,1,4.7366697986779118E-3,null,null,null,{"$f":"CB$149*(H$16+($BW524*MMULT($AD524:$AH524,CC$3:CC$7)))","v":-3.0011774936086315},-0.31496022971272586,-1.8401454093344214,0,-0.12251874624405128,4.9728478914191382E-2,0.72981789875938829,0.15879433424962247,0,0.88468932018612734,1.8230300321093296,2.7277926330513187E-2,0.40033235103371029,8.7104617835554871E-2,0,0.48528510480022158,29.298097462872946,429.98049397203016,93.555483356435033,0,521.224748738073]
[null,null,null,null,null,null,null,null,null,null,null,null,null,null,null,null,null,null,null,null,null,null,null,null,null,null,null,null,179,-1.4767782883199159,1.4767782883199159,3.2187298660916408E-2,-3.2187298660916408E-2,-1.4804186264827487E-2,-0.14552029555047905,179,0,0,1,0,1,1,2.5000000000000001E-3,null,1,0.98894027381654082,4.3462619208265188E-6,1.1055379821538369E-2,1,0,0,null,null,null,null,1.8946679194711646,4.7366697986779118E-3,null,null,null,null,null,null,null,null,1,1,1,1,1,1,1,1,null,1,4.7366697986779118E-3,null,null,null,{"$f":"CB$149*(H$16+($BW525*MMULT($AD525:$AH525,CC$3:CC$7)))","v":-2.9745800271987535},-0.34155769612260367,-1.8146956462796866,0,-0.14552029555047905,5.1068877040440407E-2,0.71066246396834276,0.16288747625612315,0,0.86457234292426099,1.7891911601891675,2.8542996509685975E-2,0.39719761632021805,9.103972782813291E-2,0,0.48321965934196298,30.656857251197408,426.61360449357983,97.782022965522231,0,519.00633881911165]
[null,null,null,null,null,null,null,null,null,null,null,null,null,null,null,null,null,null,null,null,null,null,null,null,null,null,null,null,190,-1.4711910413075213,1.4711910413075213,3.1870240808698505E-2,-3.1870240808698505E-2,-1.4804186264827487E-2,-0.15040859368254306,190,0,0,1,0,1,1,2.5000000000000001E-3,null,1,0.98087002138546031,3.150114733246583E-5,1.909847736720718E-2,1,0,0,null,null,null,null,1.8946679194711646,4.7366697986779118E-3,null,null,null,null,null,null,null,null,1,1,1,1,1,1,1,1,null,1,4.7366697986779118E-3,null,null,null,{"$f":"CB$149*(H$16+($BW526*MMULT($AD526:$AH526,CC$3:CC$7)))","v":-2.9686757223341411},-0.34746200098721602,-1.8094254571195099,0,-0.15040859368254306,5.1371295165439153E-2,0.70647885891871021,0.1637481901381167,0,0.86035636842067253,1.7819547126429387,2.8828619942448973E-2,0.39646285840277229,9.1892453257271939E-2,0,0.48281606839750674,30.963633619363268,425.82443126918912,98.697900236736899,0,518.5728584041218]
[null,null,null,null,null,null,null,null,null,null,null,null,null,null,null,null,null,null,null,null,null,null,null,null,null,null,null,null,204,-1.4512230268877169,1.4512230268877169,2.5829628481706682E-2,-2.5829628481706682E-2,-1.4804186264827487E-2,-0.16660999598675072,204,0,0,1,0,1,1,2.5000000000000001E-3,null,1,0.9426996253023342,1.616688703739035E-3,5.568368589392679E-2,1,0,0,null,null,null,null,1.8946679194711646,4.7366697986779118E-3,null,null,null,null,null,null,null,null,1,1,1,1,1,1,1,1,null,1,4.7366697986779118E-3,null,null,null,{"$f":"CB$149*(H$16+($BW527*MMULT($AD527:$AH527,CC$3:CC$7)))","v":-2.9426670955873448},-0.37347062773401229,-1.7954980550266972,0,-0.16660999598675072,5.272491864696708E-2,0.68834120414035749,0.166044732335388,0,0.84652969694479163,1.753640552067504,3.0065978221594812E-2,0.39252126288298833,9.468572800715909E-2,0,0.48272703088825791,32.292629196947018,421.59092582238122,101.69804162839512,0,518.47722688168801]
[null,null,null,null,null,null,null,null,null,null,null,null,null,null,null,null,null,null,null,null,null,null,null,null,null,null,null,null,206,-1.5035588380755529,1.5035588380755529,3.3048189503482234E-2,-3.3048189503482234E-2,-1.4804186264827487E-2,-0.12191960190111457,206,0,0,1,0,1,1,2.5000000000000001E-3,null,1,0.997091385871261,4.4864447304586601E-6,2.9041275840085588E-3,1,0,0,null,null,null,null,1.8946679194711646,4.7366697986779118E-3,null,null,null,null,null,null,null,null,1,1,1,1,1,1,1,1,null,1,4.7366697986779118E-3,null,null,null,{"$f":"CB$149*(H$16+($BW528*MMULT($AD528:$AH528,CC$3:CC$7)))","v":-3.0022214677969563},-0.31391625552440083,-1.8406153051927578,0,-0.12191960190111457,4.9676590755442181E-2,0.73058020765403986,0.15871973497794831,0,0.88521953560949795,1.8241960689969283,2.7232045721246333E-2,0.40049434382114657,8.70080457224226E-2,0,0.48526556473518445,29.248818989660972,430.1544837547242,93.451759226218428,0,521.20376155880751]
[null,null,null,null,null,null,null,null,null,null,null,null,null,null,null,null,null,null,null,null,null,null,null,null,null,null,null,null,209,-1.504070380208351,1.504070380208351,3.3038046707492399E-2,-3.3038046707492399E-2,-1.4804186264827487E-2,-0.1214619258538555,209,0,0,1,0,1,1,2.5000000000000001E-3,null,1,0.99563454572337096,1.0134566050440278E-5,4.355319610578565E-3,1,0,0,null,null,null,null,1.8946679194711646,4.7366697986779118E-3,null,null,null,null,null,null,null,null,1,1,1,1,1,1,1,1,null,1,4.7366697986779118E-3,null,null,null,{"$f":"CB$149*(H$16+($BW529*MMULT($AD529:$AH529,CC$3:CC$7)))","v":-3.0027228671337647},-0.31341485618759246,-1.8411369901215457,0,-0.1214619258538555,4.9651689189118609E-2,0.73094661193539856,0.1586369548787516,0,0.8856247721139594,1.8248600281172283,2.7208491842711898E-2,0.40054941237851632,8.6931026179812201E-2,0,0.48531106959895953,29.223520738592722,430.21363062466622,93.369035706893541,0,521.25263645925872]
[null,null,null,null,null,null,null,null,null,null,null,null,null,null,null,null,null,null,null,null,null,null,null,null,null,null,null,null,210,-1.5049569355105568,1.5049569355105568,3.310704642447955E-2,-3.310704642447955E-2,-1.4804186264827487E-2,-0.12069110796704806,210,0,0,1,0,1,1,2.5000000000000001E-3,null,1,0.99749338726613002,1.3894603124633944E-6,2.5052231735575134E-3,1,0,0,null,null,null,null,1.8946679194711646,4.7366697986779118E-3,null,null,null,null,null,null,null,null,1,1,1,1,1,1,1,1,null,1,4.7366697986779118E-3,null,null,null,{"$f":"CB$149*(H$16+($BW530*MMULT($AD530:$AH530,CC$3:CC$7)))","v":-3.0036784221529578},-0.31245930116839959,-1.8419545457067643,0,-0.12069110796704806,4.9604266929200155E-2,0.73164540545385093,0.15850731335206653,0,0.88630769069842108,1.8260646764335386,2.7164572848581439E-2,0.40066784867818445,8.6802683058107746E-2,0,0.4853648954151264,29.176349155426365,430.34083817735092,93.231187644587564,0,521.31044855204641]
[null,null,null,null,null,null,null,null,null,null,null,null,null,null,null,null,null,null,null,null,null,null,null,null,null,null,null,null,224,-0.10629750224200936,0.10629750224200936,-1.0425285896982341,1.0425285896982341,-1.4804186264827487E-2,-1.0868305538582492,224,0,0,1,0,1,1,2.5000000000000001E-3,null,2,3.9436475954183994E-2,0.59431360186444993,0.36624992208136609,0,1,0,null,null,null,null,1.8946679194711646,4.7366697986779118E-3,null,null,null,null,null,null,null,null,1,1,1,1,1,1,1,1,null,1,4.7366697986779118E-3,null,null,null,{"$f":"CB$149*(H$16+($BW531*MMULT($AD531:$AH531,CC$3:CC$7)))","v":-0.52938335276169646},-2.7867543705596605,-1.5189307485609307,0,-1.0868305538582492,0.58896804324000862,6.1620888274351027E-2,0.21894587002315494,0,0.33728380427372212,1.2068186058112367,0.48803361201420808,5.1060605113001874E-2,0.18142400934892541,0,0.27948177352386466,524.17680716278949,54.842093456370634,194.86005804129573,0,300.17986486895541]
[null,null,null,null,null,null,null,null,null,null,null,null,null,null,null,null,null,null,null,null,null,null,null,null,null,null,null,null,229,-1.2494098512070757,1.2494098512070757,-0.13624606761659089,0.13624606761659089,-1.4804186264827488E-2,-0.30423820849714001,229,0,0,1,0,1,1,2.5000000000000001E-3,null,1,0.78692358953010444,7.2064900661370487E-2,0.14101150970852505,1,0,0,null,null,null,null,1.8946679194711646,4.7366697986779118E-3,null,null,null,null,null,null,null,null,1,1,1,1,1,1,1,1,null,1,4.7366697986779118E-3,null,null,null,{"$f":"CB$149*(H$16+($BW532*MMULT($AD532:$AH532,CC$3:CC$7)))","v":-2.5787782238084063},-0.73735949951295132,-1.7557605754443537,0,-0.30423820849714001,7.5866639475274097E-2,0.47837539978930999,0.17277578328766074,0,0.73768512265515929,1.4647029452074041,5.1796604713272611E-2,0.32660233350017009,0.11795960665812373,0,0.50364145512843361,55.632600321155529,350.79011808115308,126.69555635121648,0,540.94054877588621]
[null,null,null,null,null,null,null,null,null,null,null,null,null,null,null,null,null,null,null,null,null,null,null,null,null,null,null,null,252,-1.4704888404715282,1.4704888404715282,3.2009458864421872E-2,-3.2009458864421872E-2,-1.4804186264827487E-2,-0.15106924265389232,252,0,0,1,0,1,1,2.5000000000000001E-3,null,1,0.99506766255507573,8.5452103640140648E-7,4.9314828238878209E-3,1,0,0,null,null,null,null,1.8946679194711646,4.7366697986779118E-3,null,null,null,null,null,null,null,null,1,1,1,1,1,1,1,1,null,1,4.7366697986779118E-3,null,null,null,{"$f":"CB$149*(H$16+($BW533*MMULT($AD533:$AH533,CC$3:CC$7)))","v":-2.9681127395538711},-0.34802498376748581,-1.8085840382277933,0,-0.15106924265389232,5.1400224462601438E-2,0.70608123542460666,0.16388602894073723,0,0.85978816258384883,1.7811556514117941,2.8857794893927532E-2,0.39641748033920943,9.2011065293949215E-2,0,0.48271365947291384,30.994969233424854,425.77569255962476,98.825296541306926,0,518.46286519505463]
[null,null,null,null,null,null,null,null,null,null,null,null,null,null,null,null,null,null,null,null,null,null,null,null,null,null,null,null,257,-1.5044966295390372,1.5044966295390372,3.3096913214701214E-2,-3.3096913214701214E-2,-1.4804186264827487E-2,-0.12109796403017324,257,0,0,1,0,1,1,2.5000000000000001E-3,null,1,0.9983299439133736,6.1471296906548353E-7,1.6694412736573392E-3,1,0,0,null,null,null,null,1.8946679194711646,4.7366697986779118E-3,null,null,null,null,null,null,null,null,1,1,1,1,1,1,1,1,null,1,4.7366697986779118E-3,null,null,null,{"$f":"CB$149*(H$16+($BW534*MMULT($AD534:$AH534,CC$3:CC$7)))","v":-3.0032079829716594},-0.31292974034969756,-1.8415043729450231,0,-0.12109796403017324,4.9627608209819235E-2,0.7313012917369428,0.15857868509067541,0,0.88594716438679699,1.8254547494242344,2.718643572264514E-2,0.40061321266254457,8.6870783918742783E-2,0,0.48532956769606755,29.199831168222197,430.28215588267045,93.304331974842569,0,521.27250450367603]
[null,null,null,null,null,null,null,null,null,null,null,null,null,null,null,null,null,null,null,null,null,null,null,null,null,null,null,null,258,-1.504070380208351,1.504070380208351,3.3038046707492399E-2,-3.3038046707492399E-2,-1.4804186264827487E-2,-0.12146192585385548,258,0,0,1,0,1,1,2.5000000000000001E-3,null,1,0.99563454572337096,1.0134566050440305E-5,4.3553196105785771E-3,1,0,0,null,null,null,null,1.8946679194711646,4.7366697986779118E-3,null,null,null,null,null,null,null,null,1,1,1,1,1,1,1,1,null,1,4.7366697986779118E-3,null,null,null,{"$f":"CB$149*(H$16+($BW535*MMULT($AD535:$AH535,CC$3:CC$7)))","v":-3.0027228671337647},-0.31341485618759246,-1.8411369901215457,0,-0.12146192585385548,4.9651689189118609E-2,0.73094661193539856,0.1586369548787516,0,0.8856247721139594,1.8248600281172283,2.7208491842711898E-2,0.40054941237851632,8.6931026179812201E-2,0,0.48531106959895953,29.223520738592722,430.21363062466622,93.369035706893541,0,521.25263645925872]
[null,null,null,null,null,null,null,null,null,null,null,null,null,null,null,null,null,null,null,null,null,null,null,null,null,null,null,null,262,-1.2494098512070757,1.2494098512070757,-0.13624606761659092,0.13624606761659092,-1.4804186264827487E-2,-0.30423820849714001,262,0,0,1,0,1,1,2.5000000000000001E-3,null,1,0.78692358953010433,7.2064900661370612E-2,0.14101150970852502,1,0,0,null,null,null,null,1.8946679194711646,4.7366697986779118E-3,null,null,null,null,null,null,null,null,1,1,1,1,1,1,1,1,null,1,4.7366697986779118E-3,null,null,null,{"$f":"CB$149*(H$16+($BW536*MMULT($AD536:$AH536,CC$3:CC$7)))","v":-2.5787782238084063},-0.7373594995129511,-1.7557605754443537,0,-0.30423820849714001,7.5866639475274097E-2,0.4783753997893101,0.17277578328766074,0,0.73768512265515929,1.4647029452074043,5.1796604713272604E-2,0.32660233350017015,0.11795960665812372,0,0.5036414551284335,55.632600321155529,350.79011808115314,126.69555635121645,0,540.9405487758861]
[null,null,null,null,null,null,null,null,null,null,null,null,null,null,null,null,null,null,null,null,null,null,null,null,null,null,null,null,264,-1.5039896523744078,1.5039896523744078,3.3082839053840941E-2,-3.3082839053840941E-2,-1.4804186264827487E-2,-0.12154531871464484,264,0,0,1,0,1,1,2.5000000000000001E-3,null,1,0.99888755001303753,2.7187985878467071E-7,1.1121780071036366E-3,1,0,0,null,null,null,null,1.8946679194711646,4.7366697986779118E-3,null,null,null,null,null,null,null,null,1,1,1,1,1,1,1,1,null,1,4.7366697986779118E-3,null,null,null,{"$f":"CB$149*(H$16+($BW537*MMULT($AD537:$AH537,CC$3:CC$7)))","v":-3.0026869316461697},-0.31345079167518719,-1.8410114699412541,0,-0.12154531871464484,4.9653473478839007E-2,0.73092034548444462,0.15865686826766884,0,0.88555092041002215,1.8247816076409746,2.7210638944914396E-2,0.40055223179795063,8.6945674815725418E-2,0,0.48529145444140959,29.225826852658333,430.21665884698689,93.3847692035488,0,521.23156862621727]
[null,null,null,null,null,null,null,null,null,null,null,null,null,null,null,null,null,null,null,null,null,null,null,null,null,null,null,null,270,-1.5035588380755529,1.5035588380755529,3.3048189503482234E-2,-3.3048189503482234E-2,-1.4804186264827487E-2,-0.12191960190111457,270,0,0,1,0,1,1,2.5000000000000001E-3,null,1,0.997091385871261,4.4864447304586567E-6,2.9041275840085562E-3,{"$f":"IF($AS538= 1,1,0)","v":1},{"$f":"IF($AS538= 2,1,0)","v":0},{"$f":"IF($AS538= 3,1,0)","v":0},null,null,null,null,1.8946679194711646,{"$f":"AQ538*BD538","v":4.7366697986779118E-3},null,null,null,null,null,null,null,null,{"$f":"INDEX(AK$148:AK$149,2-AK538)","v":1},{"$f":"INDEX(AL$148:AL$149,2-AL538)","v":1},{"$f":"INDEX(AM$148:AM$149,2-AM538)","v":1},{"$f":"INDEX(AN$148:AN$149,2-AN538)","v":1},{"$f":"INDEX(AO$148:AO$149,2-AO538)","v":1},{"$f":"INDEX(AW$148:AW$149,2-AW538)","v":1},{"$f":"INDEX(AX$148:AX$149,2-AX538)","v":1},{"$f":"INDEX(AY$148:AY$149,2-AY538)","v":1},null,1,4.7366697986779118E-3,null,null,null,{"$f":"CB$149*(H$16+($BW538*MMULT($AD538:$AH538,CC$3:CC$7)))","v":-3.0022214677969563},-0.31391625552440083,-1.8406153051927578,0,-0.12191960190111457,{"$f":"$BW538*IF(CB$149=0,0,IF(ABS(CB538)>OverflowTrigger,OverflowTrigger,EXP(CB538)))","v":4.9676590755442181E-2},{"$f":"$BW538*IF(CC$149=0,0,IF(ABS(CC538)>OverflowTrigger,OverflowTrigger,EXP(CC538)))","v":0.73058020765403986},{"$f":"$BW538*IF(CD$149=0,0,IF(ABS(CD538)>OverflowTrigger,OverflowTrigger,EXP(CD538)))","v":0.15871973497794831},{"$f":"$BW538*IF(CE$149=0,0,IF(ABS(CE538)>OverflowTrigger,OverflowTrigger,EXP(CE538)))","v":0},{"$f":"IF(L$12=\"\",0,$BW538*IF($CG$149=0,0,IF(ABS(CF538)>OverflowTrigger,OverflowTrigger,EXP(CF538))))","v":0.88521953560949795},1.8241960689969283,2.7232045721246333E-2,{"$f":"IF($CL538=0,0,CH538/$CL538)","v":0.40049434382114657},{"$f":"IF($CL538=0,0,CI538/$CL538)","v":8.70080457224226E-2},{"$f":"IF($CL538=0,0,CJ538/$CL538)","v":0},{"$f":"IF($CL538=0,0,CK538/$CL538)","v":0.48526556473518445},{"$f":"CM538*$BX538*TargetMarketSize","v":29.248818989660972},{"$f":"CN538*$BX538*TargetMarketSize","v":430.1544837547242},{"$f":"CO538*$BX538*TargetMarketSize","v":93.451759226218428},{"$f":"CP538*$BX538*TargetMarketSize","v":0},{"$f":"CQ538*$BX538*TargetMarketSize","v":521.20376155880751}]
[null,null,null,null,null,null,null,null,null,null,null,null,null,null,null,null,null,null,null,null,null,null,null,null,null,null,null,null,273,-1.4512230268877166,1.4512230268877166,2.5829628481706678E-2,-2.5829628481706678E-2,-1.4804186264827487E-2,-0.16660999598675078,273,0,0,1,0,1,1,{"$f":"AP539/$AP$554","v":2.5000000000000001E-3},null,1,0.9426996253023342,1.6166887037390263E-3,5.568368589392679E-2,1,0,0,null,null,null,null,1.8946679194711646,4.7366697986779118E-3,null,null,null,null,null,null,null,null,1,1,1,1,1,1,1,1,null,{"$f":"IF(AND(BN539:BU539),1,0)","v":1},{"$f":"BE539*BW539","v":4.7366697986779118E-3},null,null,null,{"$f":"CB$149*(H$16+($BW539*MMULT($AD539:$AH539,CC$3:CC$7)))","v":-2.9426670955873444},-0.37347062773401252,-1.795498055026697,0,{"$f":"IF($CG$149=0,0,$L$16+$AI539)","v":-0.16660999598675078},5.2724918646967107E-2,0.68834120414035727,0.16604473233538805,0,0.84652969694479163,{"$f":"IF($CG$149=0,0,SUM(CG539:CK539))","v":1.753640552067504},{"$f":"IF($CL539=0,0,CG539/$CL539)","v":3.0065978221594829E-2},0.39252126288298816,9.4685728007159117E-2,0,0.48272703088825791,32.29262919694704,421.590925822381,101.69804162839515,0,518.47722688168801]
[null,null,null,null,null,null,null,null,null,null,null,null,null,null,null,null,null,null,null,null,null,null,null,null,null,null,null,null,274,-1.5028019030522222,1.5028019030522222,3.2761150338487963E-2,-3.2761150338487963E-2,-1.4804186264827487E-2,-0.12251874624405129,274,0,0,1,0,1,1,2.5000000000000001E-3,null,1,0.9923652532224041,7.3815204836066278E-5,7.5609314727597843E-3,1,0,0,null,null,null,null,1.8946679194711646,4.7366697986779118E-3,null,null,null,null,null,null,null,null,1,1,1,1,1,1,1,1,null,1,4.7366697986779118E-3,null,null,null,{"$f":"CB$149*(H$16+($BW540*MMULT($AD540:$AH540,CC$3:CC$7)))","v":-3.0011774936086315},-0.31496022971272586,-1.8401454093344214,0,-0.12251874624405129,4.9728478914191382E-2,0.72981789875938829,0.15879433424962247,0,0.88468932018612734,1.8230300321093296,2.7277926330513187E-2,0.40033235103371029,8.7104617835554871E-2,0,0.48528510480022158,29.298097462872946,429.98049397203016,93.555483356435033,0,521.224748738073]
[null,null,null,null,null,null,null,null,null,null,null,null,null,null,null,null,null,null,null,null,null,null,null,null,null,null,null,null,275,-1.5039896523744078,1.5039896523744078,3.3082839053840941E-2,-3.3082839053840941E-2,-1.4804186264827487E-2,-0.12154531871464484,275,0,0,1,0,1,1,2.5000000000000001E-3,null,1,0.99888755001303753,2.7187985878467071E-7,1.1121780071036366E-3,1,0,0,null,null,null,null,1.8946679194711646,4.7366697986779118E-3,null,null,null,null,null,null,null,null,1,1,1,1,1,1,1,1,null,1,4.7366697986779118E-3,null,null,null,{"$f":"CB$149*(H$16+($BW541*MMULT($AD541:$AH541,CC$3:CC$7)))","v":-3.0026869316461697},-0.31345079167518719,-1.8410114699412541,0,-0.12154531871464484,4.9653473478839007E-2,0.73092034548444462,0.15865686826766884,0,0.88555092041002215,1.8247816076409746,2.7210638944914396E-2,0.40055223179795063,8.6945674815725418E-2,0,0.48529145444140959,29.225826852658333,430.21665884698689,93.3847692035488,0,521.23156862621727]
[null,null,null,null,null,null,null,null,null,null,null,null,null,null,null,null,null,null,null,null,null,null,null,null,null,null,null,null,281,-1.4512230268877169,1.4512230268877169,2.5829628481706682E-2,-2.5829628481706682E-2,-1.4804186264827487E-2,-0.16660999598675072,281,0,0,1,0,1,1,2.5000000000000001E-3,null,1,0.94269962530233409,1.6166887037390291E-3,5.5683685893926881E-2,1,0,0,null,null,null,null,1.8946679194711646,4.7366697986779118E-3,null,null,null,null,null,null,null,null,1,1,1,1,1,1,1,1,null,1,4.7366697986779118E-3,null,null,null,{"$f":"CB$149*(H$16+($BW542*MMULT($AD542:$AH542,CC$3:CC$7)))","v":-2.9426670955873448},-0.37347062773401229,-1.7954980550266972,0,-0.16660999598675072,5.272491864696708E-2,0.68834120414035749,0.166044732335388,0,0.84652969694479163,1.753640552067504,3.0065978221594812E-2,0.39252126288298833,9.468572800715909E-2,0,0.48272703088825791,32.292629196947018,421.59092582238122,101.69804162839512,0,518.47722688168801]
[null,null,null,null,null,null,null,null,null,null,null,null,null,null,null,null,null,null,null,null,null,null,null,null,null,null,null,null,283,-1.4678001097864357,1.4678001097864357,3.1852563343303497E-2,-3.1852563343303497E-2,-1.4804186264827487E-2,-0.15342050418283198,283,0,0,1,0,1,1,2.5000000000000001E-3,null,1,0.98718781982989301,1.4014475740181072E-5,1.2798165594366839E-2,1,0,0,null,null,null,null,1.8946679194711646,4.7366697986779118E-3,null,null,null,null,null,null,null,null,1,1,1,1,1,1,1,1,null,1,4.7366697986779118E-3,null,null,null,{"$f":"CB$149*(H$16+($BW543*MMULT($AD543:$AH543,CC$3:CC$7)))","v":-2.9652671133476605},-0.35087060997369668,-1.8060522030638193,0,-0.15342050418283198,5.1546698594811313E-2,0.70407484822527377,0.16430148706550779,0,0.85776895053219171,1.7776919844177845,2.8996417290869134E-2,0.39606121555184193,9.2424046744699978E-2,0,0.48251832041258896,31.143857841998781,425.39304322123985,99.268862912439772,0,518.25305955373278]
[null,null,null,null,null,null,null,null,null,null,null,null,null,null,null,null,null,null,null,null,null,null,null,null,null,null,null,null,293,-1.4121484317662432,1.4121484317662432,-1.2819181661044084E-3,1.2819181661044084E-3,-1.4804186264827487E-2,-0.19436090116023505,293,0,0,1,0,1,1,2.5000000000000001E-3,null,1,0.89652826973728339,1.1235337871542846E-2,9.2236392291173752E-2,1,0,0,null,null,null,null,1.8946679194711646,4.7366697986779118E-3,null,null,null,null,null,null,null,null,1,1,1,1,1,1,1,1,null,1,4.7366697986779118E-3,null,null,null,{"$f":"CB$149*(H$16+($BW544*MMULT($AD544:$AH544,CC$3:CC$7)))","v":-2.87648095381806},-0.43965676950329713,-1.7835350065530347,0,-0.19436090116023505,5.6332651642671323E-2,0.64425751196424041,0.16804306274644679,0,0.82336069880941298,1.6919939251627714,3.3293648874804363E-2,0.38076821812599726,9.9316587516873556E-2,0,0.48662154548232489,35.759337341473682,408.96746439779884,106.67185714532903,0,522.66016464480981]
[null,null,null,null,null,null,null,null,null,null,null,null,null,null,null,null,null,null,null,null,null,null,null,null,null,null,null,null,299,-1.4999707496589294,1.4999707496589294,3.1299532424485528E-2,-3.1299532424485528E-2,-1.4804186264827487E-2,-0.1246594104213124,299,0,0,1,0,1,1,2.5000000000000001E-3,null,1,0.98637416868402272,5.3614844350214394E-4,1.3089682772475094E-2,1,0,0,null,null,null,null,1.8946679194711646,4.7366697986779118E-3,null,null,null,null,null,null,null,null,1,1,1,1,1,1,1,1,null,1,4.7366697986779118E-3,null,null,null,{"$f":"CB$149*(H$16+($BW545*MMULT($AD545:$AH545,CC$3:CC$7)))","v":-2.9968847223013362},-0.31925300102002097,-1.838775873855131,0,-0.1246594104213124,4.9942410753334207E-2,0.7266916723124498,0.15901195771179885,0,0.88279752302402814,1.818443563801611,2.7464372140824294E-2,0.39962289002427936,8.7443988296986699E-2,0,0.48546874953790969,29.498351230547676,429.21849111490076,93.919987194981132,0,521.42199398898163]
[null,null,null,null,null,null,null,null,null,null,null,null,null,null,null,null,null,null,null,null,null,null,null,null,null,null,null,null,314,-1.2179756897443563,1.2179756897443563,8.8977411819037289E-3,-8.8977411819037289E-3,-1.4804186264827487E-2,-0.36972330296494182,314,0,0,1,0,1,1,2.5000000000000001E-3,null,1,0.78843850026538431,4.2660957889552641E-3,0.20729540384566042,1,0,0,null,null,null,null,1.8946679194711646,4.7366697986779118E-3,null,null,null,null,null,null,null,null,1,1,1,1,1,1,1,1,null,1,4.7366697986779118E-3,null,null,null,{"$f":"CB$149*(H$16+($BW546*MMULT($AD546:$AH546,CC$3:CC$7)))","v":-2.6924878711441815},-0.62364985217717583,-1.5791826051831397,0,-0.36972330296494182,6.7712270241987102E-2,0.53598459865478354,0.20614353001082308,0,0.69092548122283548,1.5007658801304293,4.5118476598163551E-2,0.35714071445187834,0.13735888637933816,0,0.46038192257061988,48.45989789446282,383.59013559863786,147.53152390590202,0,494.47726613040845]
[null,null,null,null,null,null,null,null,null,null,null,null,null,null,null,null,null,null,null,null,null,null,null,null,null,null,null,null,319,-2.4351537982519561E-3,2.4351537982519561E-3,-1.2269722048433231,1.2269722048433231,-1.4804186264827487E-2,-1.1315418915572346,319,0,0,1,0,1,1,2.5000000000000001E-3,null,2,1.6854319220859016E-4,0.96808724333018092,3.174421337761045E-2,0,1,0,null,null,null,null,1.8946679194711646,4.7366697986779118E-3,null,null,null,null,null,null,null,null,1,1,1,1,1,1,1,1,null,1,4.7366697986779118E-3,null,null,null,{"$f":"CB$149*(H$16+($BW547*MMULT($AD547:$AH547,CC$3:CC$7)))","v":-0.24107738917284993},-3.0750603341485072,-1.5995120152622622,0,-1.1315418915572346,0.78578081310806336,4.6186841653850105E-2,0.20199506445666834,0,0.3225355579685949,1.3564982771871767,0.5792715157275774,3.4048581137620569E-2,0.14890919351222737,0,0.2377707096225746,622.1716826864606,36.570178999518454,159.93723319645636,0,255.37972864697571]
[null,null,null,null,null,null,null,null,null,null,null,null,null,null,null,null,null,null,null,null,null,null,null,null,null,null,null,null,334,-1.4943607410326352,1.4943607410326352,2.8346091206437562E-2,-2.8346091206437562E-2,-1.4804186264827487E-2,-0.12888640715316674,334,0,0,1,0,1,1,2.5000000000000001E-3,null,1,0.98314345941865167,1.726201501322372E-3,1.5130338980025989E-2,1,0,0,null,null,null,null,1.8946679194711646,4.7366697986779118E-3,null,null,null,null,null,null,null,null,1,1,1,1,1,1,1,1,null,1,4.7366697986779118E-3,null,null,null,{"$f":"CB$149*(H$16+($BW548*MMULT($AD548:$AH548,CC$3:CC$7)))","v":-2.9883212724569939},-0.32781645086436328,-1.8361193064468848,0,-0.12888640715316674,5.0371926526524682E-2,0.72049525385027313,0.15943494529492688,0,0.87907381637168425,1.8093759420434088,2.7839392221407244E-2,0.39820096924500153,8.8115986064714616E-2,0,0.48584365246887667,29.901144857098508,427.69126455555761,94.641752326801381,0,521.82466178995378]
[null,null,null,null,null,null,null,null,null,null,null,null,null,null,null,null,null,null,null,null,null,null,null,null,null,null,null,null,335,-3.1635459696207035E-5,3.1635459696207035E-5,-1.2329054070828427,1.2329054070828427,-1.4804186264827485E-2,-1.1321461633480443,335,0,0,1,0,1,1,2.5000000000000001E-3,null,2,2.0168346860859865E-7,0.99884278874143795,1.1570094750934902E-3,0,1,0,null,null,null,null,1.8946679194711646,4.7366697986779118E-3,null,null,null,null,null,null,null,null,1,1,1,1,1,1,1,1,null,1,4.7366697986779118E-3,null,null,null,{"$f":"CB$149*(H$16+($BW549*MMULT($AD549:$AH549,CC$3:CC$7)))","v":-0.2327406685947746},-3.0833970547265821,-1.6030416991632261,0,-1.1321461633480443,0.79235903046325729,4.5803395423457176E-2,0.20128334254519337,0,0.32234071770354811,1.3617864861354558,0.58185261678712386,3.3634784813763488E-2,0.14780829784587235,0,0.23670430055324043,624.94393705388757,36.125737406735723,158.75480649222246,0,254.23434257656555]
[null,null,null,null,null,null,null,null,null,null,null,null,null,null,null,null,null,null,null,null,null,null,null,null,null,null,null,null,372,-0.92174945695599475,0.92174945695599475,-0.29669986543175952,0.29669986543175952,-1.4804186264827487E-2,-0.55423597070688724,372,0,0,1,0,1,1,2.5000000000000001E-3,null,3,0.44736449693827962,9.0525109703141482E-2,0.46211039325857889,0,0,1,null,null,null,null,1.8946679194711646,4.7366697986779118E-3,null,null,null,null,null,null,null,null,1,1,1,1,1,1,1,1,null,1,4.7366697986779118E-3,null,null,null,{"$f":"CB$149*(H$16+($BW550*MMULT($AD550:$AH550,CC$3:CC$7)))","v":-2.0906640317421563},-1.2254736915792006,-1.5885539790084415,0,-0.55423597070688724,0.12360503089632947,0.29361858272658264,0.2042207057541516,0,0.5745110368177232,1.1959553561947869,0.10335254594252409,0.24550965151475151,0.17075947249730775,0,0.48037833004541669,111.00671390379685,263.69180747104974,183.40571813696121,0,515.95458401760345]
[null,null,null,null,null,null,null,null,null,null,null,null,null,null,null,null,null,null,null,null,null,null,null,null,null,null,null,null,381,-8.5155814897033063E-4,8.5155814897033063E-4,-1.2314118024171508,1.2314118024171508,-1.4804186264827487E-2,-1.1318029043989772,381,0,0,1,0,1,1,2.5000000000000001E-3,null,2,2.3906408191256331E-4,0.98456806580895273,1.5192870009134666E-2,0,1,0,null,null,null,null,1.8946679194711646,4.7366697986779118E-3,null,null,null,null,null,null,null,null,1,1,1,1,1,1,1,1,null,1,4.7366697986779118E-3,null,null,null,{"$f":"CB$149*(H$16+($BW551*MMULT($AD551:$AH551,CC$3:CC$7)))","v":-0.23505419594974075},-3.0810835273716162,-1.6023680171868082,0,-1.1318029043989772,0.79052800505171428,4.5909485505553391E-2,0.20141898919143936,0,0.32245138303189408,1.3603078627806011,0.58113903968458902,3.3749334809923065E-2,0.14806867967352583,0,0.23704294583196203,624.1775132706415,36.24877084084617,159.03447189170038,0,254.5980675262231]
[null,null,null,null,null,null,null,null,null,null,null,null,null,null,null,null,null,null,null,null,null,null,null,null,null,null,null,null,388,-1.0397783566571616E-3,1.0397783566571616E-3,-1.2304343429484448,1.2304343429484448,-1.4804186264827487E-2,-1.1318881585621612,388,0,0,1,0,1,1,2.5000000000000001E-3,null,2,7.5313557817342368E-5,0.9786204552233122,2.1304231118870413E-2,0,1,0,null,null,null,null,1.8946679194711646,4.7366697986779118E-3,null,null,null,null,null,null,null,null,1,1,1,1,1,1,1,1,null,1,4.7366697986779118E-3,null,null,null,{"$f":"CB$149*(H$16+($BW552*MMULT($AD552:$AH552,CC$3:CC$7)))","v":-0.23621987562613356},-3.0799178476952234,-1.6015787779257891,0,-1.1318881585621612,0.78960703950230271,4.5963032462997537E-2,0.20157801971393507,0,0.32242389388086512,1.3595719855601005,0.58077619124890223,3.3806987015889585E-2,0.14826579383429361,0,0.2371510279009145,623.78779270668826,36.310692701360445,159.24618409531564,0,254.7141540260468]
[null,null,null,null,null,null,null,null,null,null,null,null,null,null,null,null,null,null,null,null,null,null,null,null,null,null,null,null,391,-7.4866896766165582E-5,7.4866896766165582E-5,-1.2327921752768665,1.2327921752768665,-1.4804186264827487E-2,-1.1321369781671908,391,0,0,1,0,1,1,2.5000000000000001E-3,null,2,4.5598832601208834E-7,0.9982578132724278,1.7417306392461961E-3,0,1,0,null,null,null,null,1.8946679194711646,4.7366697986779118E-3,null,null,null,null,null,null,null,null,1,1,1,1,1,1,1,1,null,1,4.7366697986779118E-3,null,null,null,{"$f":"CB$149*(H$16+($BW553*MMULT($AD553:$AH553,CC$3:CC$7)))","v":-0.23289713183782079},-3.0832405914835364,-1.6029716987943197,0,-1.1321369781671908,0.79223506509795849,4.5810562531927536E-2,0.20129743294658717,0,0.32234367847493423,1.3616867390514074,0.58180420090589535,3.3642512053719917E-2,0.14782947294237228,0,0.23672381409801252,624.89193554945518,36.13403691699245,158.77754979145729,0,254.25530127150637]
[null,null,null,null,null,null,null,null,null,null,null,null,null,null,null,null,null,null,null,null,null,null,null,null,null,null,null,null,null,null,null,null,null,null,null,null,null,null,null,null,null,{"$f":"SUM(AP153:AP553)","v":400},{"$f":"SUM(AQ154:AQ553)","v":0.99999999999998967},null,null,null,null,null,null,null,null,null,null,{"$f":"SUM(BB154:BB553)","v":1.0000000000000007},{"$f":"SUM(BC154:BC553)","v":1},null,{"$f":"SUM(BE154:BE553)","v":0.99999999999999967},null,null,null,null,null,null,null,null,null,null,null,null,null,null,null,null,null,{"$f":"SUM(BW154:BW553)","v":400},{"$f":"SUM($BX$151:$BX$553)","v":0.99999999999999967},null,null,null,null,null,null,null,null,null,null,null,null,null,null,null,null,null,null,"Total:",{"$f":"SUM(CR154:CR553)","v":63854.351182312595},{"$f":"SUM(CS154:CS553)","v":44379.874757076133},40312.973543071013,0,78206.800517540221,{"$f":"SUM($CR$554:$CV$554)","v":226753.99999999997}]
[null,null,null,null,null,null,null,null,null,null,null,null,null,null,null,null,null,null,null,null,null,null,null,null,null,null,null,null,null,null,null,null,null,null,null,null,null,null,null,null,null,null,null,null,null,null,null,null,null,null,null,null,null,null,null,null,null,null,null,null,null,null,null,null,null,null,null,null,null,null,null,null,null,null,null,null,null,null,null,null,null,null,null,null,null,null,null,null,null,null,null,null,null,null,"Potential market share:",{"$f":"IF($CW$554=0,0,CR554/$CW$554)","v":0.28160187331783609},{"$f":"IF($CW$554=0,0,CS554/$CW$554)","v":0.19571815605050469},0.17778285517817113,0,0.34489711545348806]

{"sheet":"Diffusion model","index":2,"n_rows":163,"n_cols":15,"rows_kept":163,"cut":false,"hidden":false,"merged":[[46,2,47,3],[46,5,47,6]]}
["Bass Diffusion Model"]
["Directions:","        Introductions of new products (if that's what \"Your prod.\" on the Main sheet represents) don't reach potential share right away, for a number"]
[null,"of reasons.  Two main ones are lack of awareness and marketing efforts.  Diffusion models attempt to describe the time it takes for new products"]
[null,"to achieve their potential by simulating the impact of word of mouth and marketing efforts over time.  "]
[null,"        This worksheet takes the estimate of market potential for alternative A in the Main sheet and plots an innovation diffusion curve using the"]
[null,"Bass model*.  By choosing appropriate values of p and q, you can simulate the adoption path of alternative A over time.  By default, typical values"]
[null,"of p and q appear below.  If you have history of a like product, you can use Solver to estimate p and q from your data.  Otherwise, you can select"]
[null,"values already calculated for a number of products from the table at the bottom of this page."]
[]
[null,"p =",0.03,"The coefficient of innovation, this parameter"]
[null,null,null,"represents the effect of external influences"]
[null,null,null,"such as media communications on"]
[null,null,null,"the rate of adoption.  "]
[]
[null,"q =",0.38,"The coefficient of imitation, this coefficient"]
[null,null,null,"represents the effect of prior adoption,"]
[null,null,null,"word of mouth and other internal influences"]
[null,null,null,"on new adoption."]
[]
[]
[]
[]
[]
[null,"N =",{"$f":"AltAPotential","v":40312.973543071013},"(potential market for alternative Your prod."]
[null,null,null,"from Main worksheet)"]
[]
[]
[null,"Years:",0,{"$f":"C28+1","v":1},{"$f":"D28+1","v":2},3,4,5,6,7,8,9,10,11,12]
[null,"  a = q / p:",{"$f":"q/p","v":12.666666666666668},12.666666666666668,12.666666666666668,12.666666666666668,12.666666666666668,12.666666666666668,12.666666666666668,12.666666666666668,12.666666666666668,12.666666666666668,12.666666666666668,12.666666666666668,12.666666666666668]
[null,"  b = p + q:",{"$f":"p+q","v":0.41000000000000003},0.41000000000000003,0.41000000000000003,0.41000000000000003,0.41000000000000003,0.41000000000000003,0.41000000000000003,0.41000000000000003,0.41000000000000003,0.41000000000000003,0.41000000000000003,0.41000000000000003,0.41000000000000003]
[null,"  x = Exp(-b * t):",{"$f":"EXP(-C30*C28)","v":1},{"$f":"EXP(-D30*D28)","v":0.6636502501363194},0.44043165450599925,0.29229257768085942,0.19398004229089189,0.12873490358780418,8.5434950967321233E-2,5.6698926579846903E-2,3.76282568071762E-2,2.4972002042276144E-2,1.6572675401761237E-2,1.0998460175806872E-2,7.2991308467885829E-3]
[null,"  y = 1 + a * x:",{"$f":"1+C29*C31","v":13.666666666666668},{"$f":"1+D29*D31","v":9.4062365017267133},6.5788009570759911,4.7023726506242198,3.4570805356846308,2.6306421121121861,2.0821760455860687,1.7181864033447276,1.476624586224232,1.3163120258688312,1.2099205550889758,1.1393138288935538,1.0924556573926554]
[null,"Diffusion factor*:",0,{"$f":"(1-D31)/D32","v":3.575816425644162E-2},{"$f":"(1-E31)/E32","v":8.505628140218216E-2},0.15050007196371293,0.23315047173163006,0.3311986424913736,0.43923521787287528,0.54900974165775329,0.65173758595855003,0.74072710633647598,0.81280322122134618,0.8680677042116336,0.90868756313869348]
[null,"Adoption:",{"$f":"N*C33","v":0},1441.5179296187187,3428.8716218381724,6067.1054193034424,9398.9887984717279,13351.60211225578,17706.877717294254,22132.215190337261,26273.480059771999,29860.912240377904,32766.514752819025,34994.390393477981,36631.89769172782]
[null,"Unit sales:",0,{"$f":"D34-C34","v":1441.5179296187187},{"$f":"E34-D34","v":1987.3536922194537},2638.2337974652701,3331.8833791682855,3952.6133137840516,4355.2756050384742,4425.3374730430078,4141.2648694347372,3587.4321806059052,2905.6025124411208,2227.8756406589564,1637.5072982498386]
[null,"Revenues:",{"$f":"IF(ISNUMBER(APrice),C35*APrice,0)","v":0},36037.948240467966,49683.842305486345,65955.844936631751,83297.084479207144,98815.332844601289,108881.89012596186,110633.43682607519,103531.62173586842,89685.804515147625,72640.062811028023,55696.891016473906,40937.682456245966]
[]
["*Source:","Bass, Frank (1969). \"A new product growth model for consumer durables\". Management Science 15 (5): pp. 215-227."]
[null,"For more information, see",null,null,"http://www.bassbasement.org/BassModel/WhichBassModelEquation.aspx"]
[]
[]
["General approach recommended by Christophe Van den Bulte"]
["Source:","Van den Bulte, Christophe (October 2012), \"Want to know how diffusion speed varies across countries and products? Try using a Bass model\", PDMA Visions: Vol. XXVI No. 4"]
["URL:","https://marketing.wharton.upenn.edu/files/?whdmsaction=public:main.file&fileID=621"]
["Based on:","Meta-analysis of 113 papers published between January 1969 and May 2000."]
[]
[null,null,"90% confidence interval",null,null,"90% confidence interval"]
["Product","p",null,null,"q"]
["Baseline case:"]
["US, consumer durable, launch in ’76:",1.6E-2,1.2E-2,2.1000000000000001E-2,0.40899999999999997,0.35499999999999998,0.47099999999999997]
["For other cases, multiply by the following factors:"]
["Cellular telephone",0.22600000000000001,0.125,0.40899999999999997,0.63500000000000001,0.46500000000000002,0.86799999999999999]
["Non durable product",0.68899999999999995,0.41499999999999998,1.143,0.93100000000000005,0.71299999999999997,1.216]
["Industrial",1.0580000000000001,0.67900000000000005,1.65,1.149,0.90900000000000003,1.4510000000000001]
["Non commercial innovation",0.36499999999999999,0.14599999999999999,0.91,2.4060000000000001,1.488,3.891]
["Western Europe ",0.46400000000000002,0.29599999999999999,0.72899999999999998,0.94899999999999995,0.748,1.2030000000000001]
["Asia",0.59499999999999997,0.36,0.98099999999999998,0.74299999999999999,0.57099999999999995,0.96599999999999997]
["Other regions",0.79600000000000004,0.315,2.008,0.69899999999999995,0.42899999999999999,1.137]
["For each year after 1976, multiply by:",1.0209999999999999,1.002,1.0409999999999999,1.028,1.018,1.0389999999999999]
[]
[]
["From other studies, values of p and q for selected industries"]
[]
["Product","p","q","Data used","Source","URL"]
["3G subscribers in China",1E-3,8.8999999999999996E-2,"2010-2011","Liu, Xiaoping, Linjie Li and Yi Li (2012), \"Research of Forecasting the Number of 3G Users Based the BASS Model\", paper presented to TDThe\n2nd International Conference on Computer Application and System Modeling.","http://www.atlantis-press.com/php/download_paper.php?id=2742"]
["Accountant licensing",3.3999999999999998E-3,5.7999999999999996E-3,"1896-1951","Mahajan, Vijay, K.E. Haynes and K.C. Bal Kumar (1977) \"Modeling the diffusion of public policy innovations among the U.S. states.\" Socio-Economic Planning Sciences 11: 259-263","http://www.sciencedirect.com/science/article/pii/0038012177900106"]
["AFV, passenger",6.7699999999999998E-4,3.8600000000000002E-2,"1999-2011","Shoemaker, Michael H., \"A Bass Diffusion Model Analysis: Understanding Alternative Fuel Vehicle Sales\" (2012). CMC Senior Theses. Paper 399.","http://scholarship.claremont.edu/cmc_theses/399/"]
["AFV, utility",7.7600000000000004E-3,3.9100000000000003E-2,"2004-2011","Shoemaker, ibid."]
["Air conditioners, room",1.0399E-2,0.41860999999999998,"1946-1961","Bass, Frank, ibid p.218"]
["Answering machines",5.8000000000000003E-8,0.54330000000000001,"1982-1990","Jiang, Zhengrui, Frank Bass and Portia Isaacson Bass. \"Virtual Bass Model and the left-hand data-truncation bias in diffusion of innovation studies.\"  International Journal of Research in Marketing 23 (2006) 93–106. URL: http://www.bus.iastate.edu/zjiang/research/vbm_ijrm.pdf","http://www.bus.iastate.edu/zjiang/research/vbm_ijrm.pdf"]
["AOL change in subs.",1.8000000000000001E-4,1.1827000000000001,"1933-1997","Jiang, et al. ibid."]
["ATM machines",5.2999999999999998E-4,0.49569999999999997,"1971-1985","Jiang, et al. ibid."]
["B&W TV",6.4000000000000005E-4,0.41599999999999998,"1946-1956","Jiang, et al. ibid."]
["Blender",1E-3,0.55000000000000004,"1958-1971","Jiang, et al. ibid."]
["Broilers",3.5999999999999998E-8,0.96679999999999999,"1946-1956","Jiang, et al. ibid."]
["Business & consumer products",1.8E-3,0.40250000000000002,"N/A","Jiang, et al. ibid."]
["Cable TV subscriptions",6.1E-6,0.50119999999999998,"1953-1971","Jiang, et al. ibid."]
["Camcorders",9.3999999999999994E-5,0.46789999999999998,"1985-1991","Jiang, et al. ibid."]
["Can opener",1.35E-2,0.3,"1958-1971","Cited in Joshi, Amit, \"Product Life Cycle and The Bass Model\", p.4","http://www.bus.ucf.edu/faculty/ajoshi/file.axd?file=2013/1/diffusion+and+bass+model+pmba.pdf"]
["Cassette decks",1E-3,0.28749999999999998,"1974-1984","Jiang, et al. ibid."]
["CAT body scanner",1.6434989000280853E-4,1.7772865506183659,"1972-1978","Data from Mahajan, Vijay and Robert Peterson (1985), \"Models for Innovation Diffusion.\" Sage University Paper series on Quantitative Applications in the Social Sciences, 07-048. Newbury Park, London and New Delhi: Sage Pubns, p.55."]
["CAT head scanner",4.0810565599596858E-3,1.3567166782133167,"1972-1978","Mahajan and Peterson, ibid."]
["CD players",1.6999999999999999E-3,0.39910000000000001,"1983-1996","Jiang, et al. ibid."]
["Cell phone subscriptions",7.3999999999999999E-4,0.41320000000000001,"1984-1995","Jiang, et al. ibid."]
["Clothes dryers",1.3999999999999999E-6,0.47920000000000001,"1950-1957","Jiang, et al. ibid."]
["Clothes washers",1.6199999999999999E-3,0.26869999999999999,"1922-1930","Jiang, et al. ibid."]
["Coffee makers",3.4E-5,0.40860000000000002,"1948-1957","Jiang, et al. ibid."]
["Color TV",5.0000000000000002E-5,0.64800000000000002,"1954-1969","Jiang, et al. ibid."]
["Community affairs programs",2.2000000000000001E-3,1.47E-2,"1959-1970","Mahajan et al, ibid."]
["Consumer electronics",1.4E-3,0.43690000000000001,"N/A","Jiang, et al. ibid."]
["Contact lenses",0.01,3.8999999999999998E-3,1990,"Sundar","http://faculty.washington.edu/sundar/NPM/BASS-Forecasting%20Model/BASS-Simulation-Sundar.xls"]
["Copying machines",5.7299999999999999E-3,0.15190000000000001,"1965-1981","Jiang, et al. ibid."]
["Curling iron",3.9899999999999998E-2,0.3,"1974-1982","Joshi, ibid."]
["Deep Fryer",3.3700000000000001E-2,0.74,"1950-1961","Joshi, ibid."]
["Digital cameras",4.0000000000000001E-3,0.61599999999999999,"1997-2007","Digital Camera Sales (1997–2008)- PMA Marketing Research, cited in Hubli, Rohan, Marketing, A Strategic View","http://marketingstrategicmanagement.blogspot.com/2010/03/2014-ebooks-takeoff-and-inflection.html"]
["Digital watches",5.5999999999999999E-3,0.35420000000000001,"1974-1984","Jiang, et al. ibid."]
["DVD players",3.7999999999999999E-2,0.42899999999999999,"1997-2009","DVD Players and DVD Software Title Sales (1997-2009) – DEG, Digital Entertainment Group, cited in Hubli, Rohan, Marketing, A Strategic View","http://marketingstrategicmanagement.blogspot.com/2010/03/2014-ebooks-takeoff-and-inflection.html"]
["E-book readers",1.7000000000000001E-2,0.54300000000000004,"2008-2013","Hubli, Rohan, Marketing, A Strategic View","http://marketingstrategicmanagement.blogspot.com/2010/03/2014-ebooks-takeoff-and-inflection.html"]
["Electric blankets",5.7000000000000003E-5,0.24890000000000001,"1949-1961","Jiang, et al. ibid."]
["Electric clothes dryer",8.0000000000000002E-3,0.4,"1947-1960","Joshi, ibid."]
["Electric range",2.4599999999999999E-3,0.49840000000000001,"1925-1931","Jiang, et al. ibid."]
["Electric shavers",9.7999999999999997E-5,0.27750000000000002,"1948-1958","Jiang, et al. ibid."]
["Electric Toothbrush",8.2600000000000007E-2,0.13,"1963-1971","Joshi, ibid."]
["Energy-saving technologies in commercial building partnerships",8.42E-5,0.35899999999999999,"2000-2013","Antonopoulos, C.A., H.E. Dillon and M.C. Baechle (Sep. 2013) , Commercial Building Partnerships Replication and Diffusion, Pacific Northwest National Laboratory, 36","http://www.pnnl.gov/main/publications/external/technical_reports/PNNL-22833.pdf"]
["Fax machines",1.98E-3,0.26369999999999999,"1987-1998","Jiang, et al. ibid."]
["Fire extinguisher",6.9400000000000003E-2,0.16,"1975-1982","Joshi, ibid."]
["Food processor",2.7099999999999999E-2,0.51,"1978-1984","Joshi, ibid."]
["Freezers",3.8000000000000002E-5,0.38129999999999997,"1946-1954","Jiang, et al. ibid."]
["Gasoline tax",7.2999999999999995E-2,1.41E-2,"1919-1929","Mahajan et al, ibid."]
["Hair Setter",0.1305,0.35,"1968-1977","Joshi, ibid."]
["Handheld calculators",1.3600000000000001E-3,0.438,"1970-1981","Jiang, et al. ibid."]
["Hard drives, self-encrypting, for desktops",3.0000000000000001E-5,1.1499999999999999,2010,"Coughlin, Thomas (August 2011), Self-Encrypting Drive Market and Technology Report, 18.","http://www.trustedcomputinggroup.org/files/resource_files/8CA99975-1A4B-B294-D0D425207CA04BAA/Self-Encrypting_Drive_Market_and_Technology_Analysis.pdf"]
["Hard drives, self-encrypting, for laptop enterprise applications",3.0000000000000001E-5,1.35,2010,"Ibid, p. 17."]
["Hard drives, self-encrypting, for laptops",5.0000000000000002E-5,1.1000000000000001,2010,"Ibid, p. 18."]
["Heating pads",3.5000000000000001E-3,0.3463,"1922-1930","Jiang, et al. ibid."]
["Home appliances",8.9999999999999998E-4,0.42130000000000001,"N/A","Jiang, et al. ibid."]
["Housewares",5.0000000000000001E-4,0.44319999999999998,"N/A","Jiang, et al. ibid."]
["Hybrid corn",3.9E-2,1.01,"N/A","Lecture, Forcasting the Sales of New Products and the Bass Model, slide 10","https://faculty.biu.ac.il/~fruchtg/829/lec/6.pdf"]
["Hybrid electric vehicle, plug-in",2.5999999999999999E-3,0.70899999999999996,"1999-2008","McManus, Walter and Richard Senter, \"Market Models for Predicting PHEV Adoption and Diffusion.\" Technical Challenges of Plug-In Hybrid Electric Vehicles and Impacts to the U.S. Power System, Subcontract No. 46827, Task 2c: Market Models for Predicting PHEV Adoption and Diffusion, Final Report","http://deepblue.lib.umich.edu/bitstream/handle/2027.42/64436/102399.pdf?sequence=1"]
["Internet on-line shopping in France",4.0000000000000001E-3,0.48499999999999999,2005,"Naseri, Mohammed and Greg Elliott (2009), Forecasting the Number of Web Shoppers in Australia: An Application of the Bass Model, ANZMAC, 1-8","http://www.duplication.net.au/ANZMAC09/papers/ANZMAC2009-709.pdf"]
["Internet paid content in Germany",6.4881100000000001E-3,6.3948390999999993E-2,"2000-2003","Stahl, Florian and Wolfgang Maass, Adoption and Diffusion of Digital Information Goods: An Empirical Analysis of the German Paid Content Market, 19th Bled eConference eValues Bled, Slovenia, June 5 - 7, 2006","https://domino.fov.uni-mb.si/proceedings.nsf/0/43053026483b863ec12571800033470f/$FILE/38_Stahl.pdf."]
["Internet subscribers, mobile, in China",5.2999999999999998E-4,7.7600000000000002E-2,2013,"Zhu Zhaojie, Zhenhong Jia, Xizhong Qin, Chuanling Cao and Chun Chang (2014), Forecasting Mobile Internet Diffusion Trend Based on Optimized Bass Model, International Journal of Multimedia and Ubiquitous Engineering 9:9 351-356","http://dx.doi.org/10.14257/ijmue.2014.9.9.35"]
["iPhone",2.5768002970502458E-2,0.70676800297050257,"N/A","Greg Elliott","https://www.dolcera.com/wiki/index.php?title=Bass_Diffusion_Analysis_for_OLED_display_phones"]
["Knife sharpener",6.5500000000000003E-2,0.5,"1957-1969","Joshi, ibid."]
["Laser disc players",2.5000000000000001E-3,0.32419999999999999,"1985-1995","Jiang, et al. ibid."]
["Lawnmowers, power",7.9000000000000006E-6,0.30909999999999999,"1948-1960","Jiang, et al. ibid."]
["McDonalds",1.7999999999999999E-2,0.54,"N/A","Lecture, ibid."]
["Microwave ovens",3.9999999999999998E-6,0.34510000000000002,"1970-1988","Jiang, et al. ibid."]
["Monitor, LCD",6.4000000000000001E-2,0.82399999999999995,"N/A","Bass_Model_OLED_analogous.xls","http://www.dolcera.com/wiki/index.php?title=Bass_Diffusion_Analysis_for_OLED_display_phones"]
["Motels",7.0000000000000001E-3,0.36,"N/A","Lecture, ibid."]
["Neonatal monitoring device",8.9999999999999998E-4,0.69950000000000001,"N/A","Gobok, Raymondm Marlina Kosasih, Masurie Lim and Henry Ma (2009) \"Forecasting for Biomedical Device Companies: Application of Techniques for a New Neuromonitoring Device.\"","http://generalengineering.sjsu.edu/docs/pdf/mse_prj_rpts/fall2009/Forecasting%20for%20Biomedical%20Device%20Companies-%20Application%20of%20Techniques%20for%20a%20New%20Neuromonitoring%20Device.pdf"]
["On-line community of MBA's",1.7000000000000001E-2,0.23799999999999999,2000,"Firth, David R.,  Cameron Lawrence, and Shawn F. Clouse (2006), Predicting Internet-based Online Community Size and Time to Peak Membership Using the Bass Model of New Product Growth,Interdisciplinary Journal of Information, Knowledge, and Management, 1, 1.","http://ijikm.org/Volume1/IJIKMv1p001-012_Firth01.pdf"]
["Optical scanners",3.88E-4,0.35299999999999998,"N/A","Tigert & Farivar (1981). The Bass New Product Growth Model: A sensitivity analysis for a high Technology product, Journal of Marketing, 45, 81-90."]
["PC generations",0.1593,1.0436000000000001,"1974-2001","Bass, Portia Isaacson and Frank Bass (2001), \"Diffusion of Technology Generations: A Model of Adoption and Repeat Sales\", Working paper.","http://www.bassbasement.org/F/N/BBDL/Bass%20and%20Bass%202001.pdf"]
["PC printers",7.1000000000000002E-4,0.80369999999999997,"1980-1986","Jiang, et al. ibid."]
["Pharmaceuticals",0.04,0.45,"1999-2010","Schäfer, Christian. \"New Product Forecasting with Analogs Does the Uptake curve of Pharmaceuticals differ by Region?\", Presentation to International Symposium of Forecasting , Boston 2012","http://www.forecasters.org/proceedings12/Schaefer_ISF2012.pdf"]
["Portable dictation machines",7.7999999999999999E-4,0.21410000000000001,"1965-1981","Jiang, et al. ibid."]
["Radio",1.034E-2,0.45369999999999999,"1922-1931","Jiang, et al. ibid."]
["Record players",1.7999999999999999E-11,0.45190000000000002,"1952-1961","Jiang, et al. ibid."]
["Refrigerators",3.6999999999999999E-4,0.23080000000000001,"1920-1940","Jiang, et al. ibid."]
["Room air conditioners",4.3999999999999997E-8,0.57010000000000005,"1946-1957","Jiang, et al. ibid."]
["Room temp. control unit",0.1,0.41,"N/A","Lilien, Gary L. , Arvind Rangaswamy, and Arnaud De Bruyn (2007). \"The Bass Model: Marketing Engineering Technical Note\", Principles of Marketing\nEngineering","http://faculty.washington.edu/sundar/NPM/BASS-Forecasting%20Model/Bass%20Model%20Technical%20Note.pdf"]
["Satellite TV subscriptions",4.6929999999999999E-2,0.33460000000000001,"1994-1998","Jiang, et al. ibid."]
["School electronic assessment",0.1,1.2290000000000001,"2003-2007","Boyle, Andrew. \"Some forecasts of the diffusion of e-assessment using a model\", The Innovation Journal: The Public Sector Innovation Journal, Volume 15(1), 2010, Article 1.","http://www.innovation.cc/scholarly-style/boyle_forecasts_diffusion3final1.pdf"]
["Sepsis monitoring device",5.1999999999999998E-3,0.83279999999999998,"N/A","Gobok, ibid."]
["Slow Cooker",6.54E-2,0.32,"1973-1982","Joshi, ibid."]
["Steam irons",1.2E-4,0.38190000000000002,"1949-1957","Jiang, et al. ibid."]
["Stroke monitoring device",4.1000000000000003E-3,0.70620000000000005,"N/A","Gobok, ibid."]
["Styling Dryer",8.9099999999999999E-2,0.18,"1974-1984","Joshi, ibid."]
["Subscription services",1E-4,0.84199999999999997,"N/A","Jiang, et al. ibid."]
["Trash compactors",6.4999999999999994E-5,0.94979999999999998,"1971-1975","Jiang, et al. ibid."]
["Traumatic brain injury monitoring device",5.1000000000000004E-3,0.80610000000000004,"N/A","Gobok, ibid."]
["Turntable",5.7700000000000001E-2,0.21,"1974-1990","Joshi, ibid."]
["TV, black & white",2.7876999999999999E-2,0.25105,"1946-1961","Bass, Frank, ibid p.218"]
["TV, color",5.0000000000000001E-3,0.84,"N/A","Joshi, ibid."]
["TV, LCD",1.9242218662993485E-2,0.85624221866299344,"N/A","Dolcera, ibid."]
["TV, Plasma",6.9736230553403564E-3,0.86497362305534031,"N/A","Dolcera, ibid."]
["TV, projection",5.1200000000000004E-3,0.20619999999999999,"1984-2001","Jiang, et al. Ibid."]
["Ultrasound devices",1.2999999999999999E-3,0.61960000000000004,"N/A","Lilien, G. L., & Rangaswamy, A. (1998). Marketing Engineering: computer-assisted marketing analysis and planning. Reading, Mass.: Addison-Wesley.","http://setpergrewma.blog.com/2014/02/10/download-marketing-engineering-computer-assisted-marketing-analysis-and-planning-book/"]
["Vacuum cleaners",4.0600000000000002E-3,0.18049999999999999,"1922-1930","Jiang, et al. ibid."]
["VCR's",1.4999999999999999E-4,0.75639999999999996,"1980-1987","Jiang, et al. ibid."]
["Waffle Iron",1.2800000000000001E-2,0.43,"1922-1931","Joshi, ibid."]
["Water softeners",1.7703E-2,0.119696,"1949-1961","Bass, Frank, ibid p.218"]

{"sheet":"Price curves","index":3,"n_rows":40,"n_cols":19,"rows_kept":40,"cut":false,"hidden":false,"merged":[]}
["Directions:","1. Set starting price in B7 and increment in A7."]
[null,"2. Press the button to generate price curves."]
[null,"3. To restore your original scenario, press the button again."]
[]
["Price increment","Price","Revenue ($MM)","Market share (%)"]
[1,null,{"$f":"AltAPotentialRevenue","v":1007.8243385767753},{"$f":"AMarketShare","v":0.17778285517817113}]
[10,25,1007.8243385767753,0.17778285517817113,null,-1000000,{"$f":"$F$7-0.01","v":-1000000.01},null,null,null,null,null,null,null,null,null,null,"Prices","Products"]
[null,{"$f":"B7+PriceIncrement","v":35},1007.8243385767753,0.17778285517817113,null,100000000,{"$f":"$F$8+0.01","v":100000000.01000001},null,null,null,null,null,null,null,null,null,null,"Price",{"$f":"Main!$H$12","v":"High-end"}]
["Which price",45,1007.8243385767753,0.17778285517817113,null,null,null,null,null,null,null,null,null,null,null,null,null,null,{"$f":"Main!$I$12","v":"Stylish"}]
["Price",55,1007.8243385767753,0.17778285517817113,null,null,null,null,null,null,null,null,null,null,null,null,null,null,{"$f":"Main!$J$12","v":"Basic"}]
[null,65,1007.8243385767753,0.17778285517817113,null,null,null,null,null,null,null,null,null,null,null,null,null,null,{"$f":"Main!$K$12","v":0}]
["Which product",75,1007.8243385767753,0.17778285517817113]
["Basic",85,1007.8243385767753,0.17778285517817113]
[null,95,1007.8243385767753,0.17778285517817113]
[null,105,1007.8243385767753,0.17778285517817113]
[null,115,1007.8243385767753,0.17778285517817113]
[null,125,1007.8243385767753,0.17778285517817113]
[null,135,1007.8243385767753,0.17778285517817113]
[null,145,1007.8243385767753,0.17778285517817113]
[null,155,1007.8243385767753,0.17778285517817113]
[null,165,1007.8243385767753,0.17778285517817113]
[null,175,1007.8243385767753,0.17778285517817113]
[null,185,1007.8243385767753,0.17778285517817113]
[null,195,1007.8243385767753,0.17778285517817113]
[null,205,1007.8243385767753,0.17778285517817113]
[null,215,1007.8243385767753,0.17778285517817113]
[null,225,1007.8243385767753,0.17778285517817113]
[null,235,1007.8243385767753,0.17778285517817113]
[null,245,1007.8243385767753,0.17778285517817113]
[null,255,1007.8243385767753,0.17778285517817113]
[null,265,1007.8243385767753,0.17778285517817113]
[null,275,1007.8243385767753,0.17778285517817113]
[null,285,1007.8243385767753,0.17778285517817113]
[null,295,1007.8243385767753,0.17778285517817113]
[null,305,1007.8243385767753,0.17778285517817113]
[null,315,1007.8243385767753,0.17778285517817113]
[null,325,1007.8243385767753,0.17778285517817113]
[null,335,1007.8243385767753,0.17778285517817113]
[null,345,1007.8243385767753,0.17778285517817113]
[null,355,1007.8243385767753,0.17778285517817113]

{"sheet":"Scenario saver","index":4,"n_rows":38,"n_cols":3,"rows_kept":38,"cut":false,"hidden":false,"merged":[[0,1,0,6],[4,0,4,2]]}
["Directions:","Click the Save… button (to the right) to copy the current scenario from the Main sheet.  To paste a scenario to the Main sheet, select a scenario using the drop-down list in cell B3, then click the Paste… button to paste the selected scenario to the Main sheet."]
[]
["Scenario selection:"]
[]
["Scenario list"]
["Scenario number","Scenario name","Description (optional)"]
[]
[]
[]
[]
[]
[]
[]
[]
[]
[]
[]
[]
[]
[]
[]
[]
[]
[]
[]
[]
[]
[]
[]
[]
[]
[]
[]
[]
[]
[]
["Saved Scenarios"]
["Scenario number","Scenario name","Description (optional)"]

{"sheet":"Assumptions","index":5,"n_rows":989,"n_cols":26,"rows_kept":989,"cut":false,"hidden":false,"merged":[[4,14,4,15],[9,14,9,15],[9,17,9,18]]}
["PINC-01","Money Income of People -- Selected Characteristics by Current Income Level: 2016"]
["Source:"," U.S. Census Bureau, Current Population Survey, 2016 Annual Social and Economic Supplement."]
["See also:","https://www2.census.gov/programs-surveys/cps/tables/pinc-01/2016/pinc01_1_2_1.xls"]
[]
[null,"Gender Order","Gender","Age Order","Age","Income Order","Income Description","Persons","New Age Order","Age Bin","New Gender Order","Gender Bin",null,null,"Gender categories",null,null,"Gender Order","New Gender Order","New Gender Bin","Age Order","New Age Order","New Age Bin","Income Order","New Income Order","New Income Bin"]
[null,1,"Male",1,"15-24",1,"0-$2,499",2711,{"$f":"VLOOKUP(D6,AgeOrderTable,2)","v":1},{"$f":"VLOOKUP(D6,AgeOrderTable,3)","v":"15-24"},{"$f":"VLOOKUP(B6,GenderOrderTable,2)","v":1},{"$f":"VLOOKUP(B6,GenderOrderTable,3)","v":"Male"},null,null,"Male",{"$f":"SUM(H6:H497)","v":112317},null,1,1,"Male",1,1,"15-24",1,0]
[null,1,"Male",2,"25-29",1,"0-$2,499",275,2,"25-39",1,"Male",null,null,"Female",{"$f":"SUM(H498:H989)","v":114437},null,2,2,"Female",2,2,"25-39",2,0]
[null,1,"Male",3,"30-34",1,"0-$2,499",281,2,"25-39",1,"Male",null,null,"Total",{"$f":"SUM(P6:P7)","v":226754},null,null,null,null,3,2,"25-39",3,0]
[null,1,"Male",4,"35-39",1,"0-$2,499",170,2,"25-39",1,"Male",null,null,null,null,null,null,null,null,4,2,"25-39",4,0]
[null,1,"Male",5,"40-44",1,"0-$2,499",171,3,"40-75+",1,"Male",null,null,"Income categories",null,null,"Age categories",null,null,5,3,"40-75+",5,0]
[null,1,"Male",6,"45-49",1,"0-$2,499",215,3,"40-75+",1,"Male",null,null,"0-$2,499",{"$f":"SUM(H6:H17)+SUM(H498:H509)","v":14686},null,"15-24",{"$f":"H6+H18+H30+H42+H54+H66+H78+H90+H102+H114+H126+H138+H150+H162+H174+H186+H198+H210+H222+H234+H246+H258+H270+H282+H294+H306+H318+H330+H342+H354+H366+H378+H390+H402+H414+H426+H438+H450+H462+H474+H486+H498+H510+H522+H534+H546+H558+H570+H582+H594+H606+H618+H630+H642+H654+H666+H678+H690+H702+H714+H726+H738+H750+H762+H774+H786+H798+H810+H822+H834+H846+H858+H870+H882+H894+H906+H918+H930+H942+H954+H966+H978","v":27392},null,6,3,"40-75+",6,0]
[null,1,"Male",7,"50-54",1,"0-$2,499",208,3,"40-75+",1,"Male",null,null,"$2,500-$4,999",{"$f":"SUM(H18:H29)+SUM(H510:H521)","v":6263},null,"25-29",19950,null,7,3,"40-75+",7,0]
[null,1,"Male",8,"55-59",1,"0-$2,499",233,3,"40-75+",1,"Male",null,null,"$5,000-$7,499",{"$f":"SUM(H30:H41)+SUM(H522:H533)","v":7658},null,"30-34",19240,null,8,3,"40-75+",8,0]
[null,1,"Male",9,"60-64",1,"0-$2,499",296,3,"40-75+",1,"Male",null,null,"$7,500-$9,999",{"$f":"SUM(H42:H53)+SUM(H534:H545)","v":10552},null,"35-39",18640,null,9,3,"40-75+",9,0]
[null,1,"Male",10,"65-69",1,"0-$2,499",135,3,"40-75+",1,"Male",null,null,"$10,000-$12,499",{"$f":"SUM(H54:H65)+SUM(H546:H557)","v":12474},null,"40-44",18015,null,10,3,"40-75+",10,0]
[null,1,"Male",11,"70-74",1,"0-$2,499",79,3,"40-75+",1,"Male",null,null,"$12,500-$14,999",{"$f":"SUM(H66:H77)+SUM(H558:H569)","v":8996},null,"45-49",19096,null,11,3,"40-75+",11,0]
[null,1,"Male",12,"75+",1,"0-$2,499",111,3,"40-75+",1,"Male",null,null,"$15,000-$17,499",{"$f":"SUM(H78:H89)+SUM(H570:H581)","v":10673},null,"50-54",20176,null,12,3,"40-75+",12,0]
[null,1,"Male",1,"15-24",2,"$2,500-$4,999",1180,1,"15-24",1,"Male",null,null,"$17,500-$19,999",{"$f":"SUM(H90:H101)+SUM(H582:H593)","v":7930},null,"55-59",20341,null,null,null,null,13,0]
[null,1,"Male",2,"25-29",2,"$2,500-$4,999",168,2,"25-39",1,"Male",null,null,"$20,000-$22,499",{"$f":"SUM(H102:H113)+SUM(H594:H605)","v":11031},null,"60-64",17987,null,null,null,null,14,0]
[null,1,"Male",3,"30-34",2,"$2,500-$4,999",144,2,"25-39",1,"Male",null,null,"$22,500-$24,999",{"$f":"SUM(H114:H125)+SUM(H606:H617)","v":6962},null,"65-69",15901,null,null,null,null,15,0]
[null,1,"Male",4,"35-39",2,"$2,500-$4,999",95,2,"25-39",1,"Male",null,null,"$25,000-$27,499",{"$f":"SUM(H126:H137)+SUM(H618:H629)","v":9623},null,"70-74",11001,null,null,null,null,16,0]
[null,1,"Male",5,"40-44",2,"$2,500-$4,999",81,3,"40-75+",1,"Male",null,null,"$27,500-$29,999",{"$f":"SUM(H138:H149)+SUM(H630:H641)","v":5534},null,"75+",19015,null,null,null,null,17,0]
[null,1,"Male",6,"45-49",2,"$2,500-$4,999",87,3,"40-75+",1,"Male",null,null,"$30,000-$32,499",{"$f":"SUM(H150:H161)+SUM(H642:H653)","v":10400},null,"Total:",{"$f":"SUM(S11:S22)","v":226754},null,null,null,null,18,0]
[null,1,"Male",7,"50-54",2,"$2,500-$4,999",93,3,"40-75+",1,"Male",null,null,"$32,500-$34,999",{"$f":"SUM(H162:H173)+SUM(H654:H665)","v":4427},null,null,null,null,null,null,null,19,0]
[null,1,"Male",8,"55-59",2,"$2,500-$4,999",130,3,"40-75+",1,"Male",null,null,"$35,000-$37,499",{"$f":"SUM(H174:H185)+SUM(H666:H677)","v":7970},null,null,null,null,null,null,null,20,0]
[null,1,"Male",9,"60-64",2,"$2,500-$4,999",136,3,"40-75+",1,"Male",null,null,"$37,500-$39,999",{"$f":"SUM(H186:H197)+SUM(H678:H689)","v":3931},null,null,null,null,null,null,null,21,0]
[null,1,"Male",10,"65-69",2,"$2,500-$4,999",62,3,"40-75+",1,"Male",null,null,"$40,000-$42,499",{"$f":"SUM(H198:H209)+SUM(H690:H701)","v":8091},null,null,null,null,null,null,null,22,0]
[null,1,"Male",11,"70-74",2,"$2,500-$4,999",50,3,"40-75+",1,"Male",null,null,"$42,500-$44,999",{"$f":"SUM(H210:H221)+SUM(H702:H713)","v":3114},null,null,null,null,null,null,null,23,0]
[null,1,"Male",12,"75+",2,"$2,500-$4,999",104,3,"40-75+",1,"Male",null,null,"$45,000-$47,499",{"$f":"SUM(H222:H233)+SUM(H714:H725)","v":5719},null,null,null,null,null,null,null,24,0]
[null,1,"Male",1,"15-24",3,"$5,000-$7,499",1223,1,"15-24",1,"Male",null,null,"$47,500-$49,999",{"$f":"SUM(H234:H245)+SUM(H726:H737)","v":3223},null,null,null,null,null,null,null,25,0]
[null,1,"Male",2,"25-29",3,"$5,000-$7,499",231,2,"25-39",1,"Male",null,null,"$50,000-$52,499",{"$f":"SUM(H246:H257)+SUM(H738:H749)","v":7128},null,null,null,null,null,null,null,26,0]
[null,1,"Male",3,"30-34",3,"$5,000-$7,499",132,2,"25-39",1,"Male",null,null,"$52,500-$54,999",{"$f":"SUM(H258:H269)+SUM(H750:H761)","v":2488},null,null,null,null,null,null,null,27,0]
[null,1,"Male",4,"35-39",3,"$5,000-$7,499",130,2,"25-39",1,"Male",null,null,"$55,000-$57,499",{"$f":"SUM(H270:H281)+SUM(H762:H773)","v":3833},null,null,null,null,null,null,null,28,0]
[null,1,"Male",5,"40-44",3,"$5,000-$7,499",102,3,"40-75+",1,"Male",null,null,"$57,500-$59,999",{"$f":"SUM(H282:H293)+SUM(H774:H785)","v":2063},null,null,null,null,null,null,null,29,0]
[null,1,"Male",6,"45-49",3,"$5,000-$7,499",116,3,"40-75+",1,"Male",null,null,"$60,000-$62,499",{"$f":"SUM(H294:H305)+SUM(H786:H797)","v":5045},null,null,null,null,null,null,null,30,0]
[null,1,"Male",7,"50-54",3,"$5,000-$7,499",111,3,"40-75+",1,"Male",null,null,"$62,500-$64,999",{"$f":"SUM(H306:H317)+SUM(H798:H809)","v":1892},null,null,null,null,null,null,null,31,0]
[null,1,"Male",8,"55-59",3,"$5,000-$7,499",120,3,"40-75+",1,"Male",null,null,"$65,000-$67,499",{"$f":"SUM(H318:H329)+SUM(H810:H821)","v":3288},null,null,null,null,null,null,null,32,0]
[null,1,"Male",9,"60-64",3,"$5,000-$7,499",140,3,"40-75+",1,"Male",null,null,"$67,500-$69,999",{"$f":"SUM(H330:H341)+SUM(H822:H833)","v":1495},null,null,null,null,null,null,null,33,0]
[null,1,"Male",10,"65-69",3,"$5,000-$7,499",106,3,"40-75+",1,"Male",null,null,"$70,000-$72,499",{"$f":"SUM(H342:H353)+SUM(H834:H845)","v":3264},null,null,null,null,null,null,null,34,0]
[null,1,"Male",11,"70-74",3,"$5,000-$7,499",60,3,"40-75+",1,"Male",null,null,"$72,500-$74,999",{"$f":"SUM(H354:H365)+SUM(H846:H857)","v":1374},null,null,null,null,null,null,null,35,0]
[null,1,"Male",12,"75+",3,"$5,000-$7,499",183,3,"40-75+",1,"Male",null,null,"$75,000-$77,499",{"$f":"SUM(H366:H377)+SUM(H858:H869)","v":2920},null,null,null,null,null,null,null,36,0]
[null,1,"Male",1,"15-24",4,"$7,500-$9,999",1051,1,"15-24",1,"Male",null,null,"$77,500-$79,999",{"$f":"SUM(H378:H389)+SUM(H870:H881)","v":1306},null,null,null,null,null,null,null,37,0]
[null,1,"Male",2,"25-29",4,"$7,500-$9,999",320,2,"25-39",1,"Male",null,null,"$80,000-$82,499",{"$f":"SUM(H390:H401)+SUM(H882:H893)","v":2724},null,null,null,null,null,null,null,38,0]
[null,1,"Male",3,"30-34",4,"$7,500-$9,999",223,2,"25-39",1,"Male",null,null,"$82,500-$84,999",{"$f":"SUM(H402:H413)+SUM(H894:H905)","v":1022},null,null,null,null,null,null,null,39,0]
[null,1,"Male",4,"35-39",4,"$7,500-$9,999",204,2,"25-39",1,"Male",null,null,"$85,000-$87,499",{"$f":"SUM(H414:H425)+SUM(H906:H917)","v":1508},null,null,null,null,null,null,null,40,0]
[null,1,"Male",5,"40-44",4,"$7,500-$9,999",209,3,"40-75+",1,"Male",null,null,"$87,500-$89,999",{"$f":"SUM(H426:H437)+SUM(H918:H929)","v":858},null,null,null,null,null,null,null,41,0]
[null,1,"Male",6,"45-49",4,"$7,500-$9,999",170,3,"40-75+",1,"Male",null,null,"$90,000-$92,499",{"$f":"SUM(H438:H449)+SUM(H930:H941)","v":1965}]
[null,1,"Male",7,"50-54",4,"$7,500-$9,999",289,3,"40-75+",1,"Male",null,null,"$92,500-$94,999",{"$f":"SUM(H450:H461)+SUM(H942:H953)","v":712}]
[null,1,"Male",8,"55-59",4,"$7,500-$9,999",305,3,"40-75+",1,"Male",null,null,"$95,000-$97,499",{"$f":"SUM(H462:H473)+SUM(H954:H965)","v":1089}]
[null,1,"Male",9,"60-64",4,"$7,500-$9,999",252,3,"40-75+",1,"Male",null,null,"$97,500-$99,999",{"$f":"SUM(H474:H485)+SUM(H966:H977)","v":768}]
[null,1,"Male",10,"65-69",4,"$7,500-$9,999",279,3,"40-75+",1,"Male",null,null,"$100,000+",{"$f":"SUM(H486:H497)+SUM(H978:H989)","v":20755}]
[null,1,"Male",11,"70-74",4,"$7,500-$9,999",171,3,"40-75+",1,"Male",null,null,"Total:",{"$f":"SUM(P11:P51)","v":226754}]
[null,1,"Male",12,"75+",4,"$7,500-$9,999",318,3,"40-75+",1,"Male"]
[null,1,"Male",1,"15-24",5,"$10,000-$12,499",1194,1,"15-24",1,"Male",null,"Sum of Persons"]
[null,1,"Male",2,"25-29",5,"$10,000-$12,499",400,2,"25-39",1,"Male",null,"New Age Order","Age Bin","New Gender Order","Gender Bin","Total"]
[null,1,"Male",3,"30-34",5,"$10,000-$12,499",277,2,"25-39",1,"Male",null,1,"15-24",1,"Male",13956,{"$f":"$R$56/$R$62","v":6.1546874586556354E-2}]
[null,1,"Male",4,"35-39",5,"$10,000-$12,499",266,2,"25-39",1,"Male",null,null,null,2,"Female",13436,{"$f":"$R$57/$R$62","v":5.9253640509097968E-2}]
[null,1,"Male",5,"40-44",5,"$10,000-$12,499",241,3,"40-75+",1,"Male",null,2,"25-39",1,"Male",29865,{"$f":"$R$58/$R$62","v":0.1317066071601824}]
[null,1,"Male",6,"45-49",5,"$10,000-$12,499",262,3,"40-75+",1,"Male",null,null,null,2,"Female",27965,{"$f":"$R$59/$R$62","v":0.12332748264639212}]
[null,1,"Male",7,"50-54",5,"$10,000-$12,499",272,3,"40-75+",1,"Male",null,3,"40-75+",1,"Male",68496,{"$f":"$R$60/$R$62","v":0.30207184878767296}]
[null,1,"Male",8,"55-59",5,"$10,000-$12,499",385,3,"40-75+",1,"Male",null,null,null,2,"Female",73036,{"$f":"$R$61/$R$62","v":0.32209354631009818}]
[null,1,"Male",9,"60-64",5,"$10,000-$12,499",270,3,"40-75+",1,"Male",null,"Grand Total",null,null,null,226754,{"$f":"SUM($S$56:$S$61)","v":1}]
[null,1,"Male",10,"65-69",5,"$10,000-$12,499",324,3,"40-75+",1,"Male"]
[null,1,"Male",11,"70-74",5,"$10,000-$12,499",251,3,"40-75+",1,"Male"]
[null,1,"Male",12,"75+",5,"$10,000-$12,499",451,3,"40-75+",1,"Male"]
[null,1,"Male",1,"15-24",6,"$12,500-$14,999",573,1,"15-24",1,"Male"]
[null,1,"Male",2,"25-29",6,"$12,500-$14,999",216,2,"25-39",1,"Male"]
[null,1,"Male",3,"30-34",6,"$12,500-$14,999",160,2,"25-39",1,"Male"]
[null,1,"Male",4,"35-39",6,"$12,500-$14,999",145,2,"25-39",1,"Male"]
[null,1,"Male",5,"40-44",6,"$12,500-$14,999",186,{"$f":"VLOOKUP(D70,AgeOrderTable,2)","v":3},{"$f":"VLOOKUP(D70,AgeOrderTable,3)","v":"40-75+"},{"$f":"VLOOKUP(B70,GenderOrderTable,2)","v":1},{"$f":"VLOOKUP(B70,GenderOrderTable,3)","v":"Male"}]
[null,1,"Male",6,"45-49",6,"$12,500-$14,999",131,3,"40-75+",1,"Male"]
[null,1,"Male",7,"50-54",6,"$12,500-$14,999",198,3,"40-75+",1,"Male"]
[null,1,"Male",8,"55-59",6,"$12,500-$14,999",246,3,"40-75+",1,"Male"]
[null,1,"Male",9,"60-64",6,"$12,500-$14,999",283,3,"40-75+",1,"Male"]
[null,1,"Male",10,"65-69",6,"$12,500-$14,999",387,3,"40-75+",1,"Male"]
[null,1,"Male",11,"70-74",6,"$12,500-$14,999",300,3,"40-75+",1,"Male"]
[null,1,"Male",12,"75+",6,"$12,500-$14,999",587,3,"40-75+",1,"Male"]
[null,1,"Male",1,"15-24",7,"$15,000-$17,499",863,1,"15-24",1,"Male"]
[null,1,"Male",2,"25-29",7,"$15,000-$17,499",478,2,"25-39",1,"Male"]
[null,1,"Male",3,"30-34",7,"$15,000-$17,499",346,2,"25-39",1,"Male"]
[null,1,"Male",4,"35-39",7,"$15,000-$17,499",288,2,"25-39",1,"Male"]
[null,1,"Male",5,"40-44",7,"$15,000-$17,499",255,3,"40-75+",1,"Male"]
[null,1,"Male",6,"45-49",7,"$15,000-$17,499",252,3,"40-75+",1,"Male"]
[null,1,"Male",7,"50-54",7,"$15,000-$17,499",268,3,"40-75+",1,"Male"]
[null,1,"Male",8,"55-59",7,"$15,000-$17,499",274,3,"40-75+",1,"Male"]
[null,1,"Male",9,"60-64",7,"$15,000-$17,499",383,3,"40-75+",1,"Male"]
[null,1,"Male",10,"65-69",7,"$15,000-$17,499",379,3,"40-75+",1,"Male"]
[null,1,"Male",11,"70-74",7,"$15,000-$17,499",324,3,"40-75+",1,"Male"]
[null,1,"Male",12,"75+",7,"$15,000-$17,499",533,3,"40-75+",1,"Male"]
[null,1,"Male",1,"15-24",8,"$17,500-$19,999",535,1,"15-24",1,"Male"]
[null,1,"Male",2,"25-29",8,"$17,500-$19,999",306,2,"25-39",1,"Male"]
[null,1,"Male",3,"30-34",8,"$17,500-$19,999",237,2,"25-39",1,"Male"]
[null,1,"Male",4,"35-39",8,"$17,500-$19,999",212,2,"25-39",1,"Male"]
[null,1,"Male",5,"40-44",8,"$17,500-$19,999",184,3,"40-75+",1,"Male"]
[null,1,"Male",6,"45-49",8,"$17,500-$19,999",217,3,"40-75+",1,"Male"]
[null,1,"Male",7,"50-54",8,"$17,500-$19,999",237,3,"40-75+",1,"Male"]
[null,1,"Male",8,"55-59",8,"$17,500-$19,999",230,3,"40-75+",1,"Male"]
[null,1,"Male",9,"60-64",8,"$17,500-$19,999",289,3,"40-75+",1,"Male"]
[null,1,"Male",10,"65-69",8,"$17,500-$19,999",329,3,"40-75+",1,"Male"]
[null,1,"Male",11,"70-74",8,"$17,500-$19,999",273,3,"40-75+",1,"Male"]
[null,1,"Male",12,"75+",8,"$17,500-$19,999",566,3,"40-75+",1,"Male"]
[null,1,"Male",1,"15-24",9,"$20,000-$22,499",887,1,"15-24",1,"Male"]
[null,1,"Male",2,"25-29",9,"$20,000-$22,499",621,2,"25-39",1,"Male"]
[null,1,"Male",3,"30-34",9,"$20,000-$22,499",456,2,"25-39",1,"Male"]
[null,1,"Male",4,"35-39",9,"$20,000-$22,499",336,2,"25-39",1,"Male"]
[null,1,"Male",5,"40-44",9,"$20,000-$22,499",312,3,"40-75+",1,"Male"]
[null,1,"Male",6,"45-49",9,"$20,000-$22,499",320,3,"40-75+",1,"Male"]
[null,1,"Male",7,"50-54",9,"$20,000-$22,499",329,3,"40-75+",1,"Male"]
[null,1,"Male",8,"55-59",9,"$20,000-$22,499",374,3,"40-75+",1,"Male"]
[null,1,"Male",9,"60-64",9,"$20,000-$22,499",344,3,"40-75+",1,"Male"]
[null,1,"Male",10,"65-69",9,"$20,000-$22,499",303,3,"40-75+",1,"Male"]
[null,1,"Male",11,"70-74",9,"$20,000-$22,499",255,3,"40-75+",1,"Male"]
[null,1,"Male",12,"75+",9,"$20,000-$22,499",490,3,"40-75+",1,"Male"]
[null,1,"Male",1,"15-24",10,"$22,500-$24,999",380,1,"15-24",1,"Male"]
[null,1,"Male",2,"25-29",10,"$22,500-$24,999",332,2,"25-39",1,"Male"]
[null,1,"Male",3,"30-34",10,"$22,500-$24,999",211,2,"25-39",1,"Male"]
[null,1,"Male",4,"35-39",10,"$22,500-$24,999",182,2,"25-39",1,"Male"]
[null,1,"Male",5,"40-44",10,"$22,500-$24,999",151,3,"40-75+",1,"Male"]
[null,1,"Male",6,"45-49",10,"$22,500-$24,999",188,3,"40-75+",1,"Male"]
[null,1,"Male",7,"50-54",10,"$22,500-$24,999",201,3,"40-75+",1,"Male"]
[null,1,"Male",8,"55-59",10,"$22,500-$24,999",263,3,"40-75+",1,"Male"]
[null,1,"Male",9,"60-64",10,"$22,500-$24,999",260,3,"40-75+",1,"Male"]
[null,1,"Male",10,"65-69",10,"$22,500-$24,999",319,3,"40-75+",1,"Male"]
[null,1,"Male",11,"70-74",10,"$22,500-$24,999",228,3,"40-75+",1,"Male"]
[null,1,"Male",12,"75+",10,"$22,500-$24,999",491,3,"40-75+",1,"Male"]
[null,1,"Male",1,"15-24",11,"$25,000-$27,499",615,1,"15-24",1,"Male"]
[null,1,"Male",2,"25-29",11,"$25,000-$27,499",638,2,"25-39",1,"Male"]
[null,1,"Male",3,"30-34",11,"$25,000-$27,499",495,2,"25-39",1,"Male"]
[null,1,"Male",4,"35-39",11,"$25,000-$27,499",393,2,"25-39",1,"Male"]
[null,1,"Male",5,"40-44",11,"$25,000-$27,499",336,3,"40-75+",1,"Male"]
[null,1,"Male",6,"45-49",11,"$25,000-$27,499",380,3,"40-75+",1,"Male"]
[null,1,"Male",7,"50-54",11,"$25,000-$27,499",329,3,"40-75+",1,"Male"]
[null,1,"Male",8,"55-59",11,"$25,000-$27,499",318,3,"40-75+",1,"Male"]
[null,1,"Male",9,"60-64",11,"$25,000-$27,499",289,{"$f":"VLOOKUP(D134,AgeOrderTable,2)","v":3},{"$f":"VLOOKUP(D134,AgeOrderTable,3)","v":"40-75+"},{"$f":"VLOOKUP(B134,GenderOrderTable,2)","v":1},{"$f":"VLOOKUP(B134,GenderOrderTable,3)","v":"Male"}]
[null,1,"Male",10,"65-69",11,"$25,000-$27,499",219,3,"40-75+",1,"Male"]
[null,1,"Male",11,"70-74",11,"$25,000-$27,499",179,3,"40-75+",1,"Male"]
[null,1,"Male",12,"75+",11,"$25,000-$27,499",402,3,"40-75+",1,"Male"]
[null,1,"Male",1,"15-24",12,"$27,500-$29,999",293,1,"15-24",1,"Male"]
[null,1,"Male",2,"25-29",12,"$27,500-$29,999",325,2,"25-39",1,"Male"]
[null,1,"Male",3,"30-34",12,"$27,500-$29,999",260,2,"25-39",1,"Male"]
[null,1,"Male",4,"35-39",12,"$27,500-$29,999",211,2,"25-39",1,"Male"]
[null,1,"Male",5,"40-44",12,"$27,500-$29,999",169,3,"40-75+",1,"Male"]
[null,1,"Male",6,"45-49",12,"$27,500-$29,999",152,3,"40-75+",1,"Male"]
[null,1,"Male",7,"50-54",12,"$27,500-$29,999",170,3,"40-75+",1,"Male"]
[null,1,"Male",8,"55-59",12,"$27,500-$29,999",217,3,"40-75+",1,"Male"]
[null,1,"Male",9,"60-64",12,"$27,500-$29,999",207,3,"40-75+",1,"Male"]
[null,1,"Male",10,"65-69",12,"$27,500-$29,999",198,3,"40-75+",1,"Male"]
[null,1,"Male",11,"70-74",12,"$27,500-$29,999",174,3,"40-75+",1,"Male"]
[null,1,"Male",12,"75+",12,"$27,500-$29,999",247,3,"40-75+",1,"Male"]
[null,1,"Male",1,"15-24",13,"$30,000-$32,499",509,1,"15-24",1,"Male"]
[null,1,"Male",2,"25-29",13,"$30,000-$32,499",704,2,"25-39",1,"Male"]
[null,1,"Male",3,"30-34",13,"$30,000-$32,499",535,2,"25-39",1,"Male"]
[null,1,"Male",4,"35-39",13,"$30,000-$32,499",434,2,"25-39",1,"Male"]
[null,1,"Male",5,"40-44",13,"$30,000-$32,499",493,3,"40-75+",1,"Male"]
[null,1,"Male",6,"45-49",13,"$30,000-$32,499",474,3,"40-75+",1,"Male"]
[null,1,"Male",7,"50-54",13,"$30,000-$32,499",468,3,"40-75+",1,"Male"]
[null,1,"Male",8,"55-59",13,"$30,000-$32,499",410,3,"40-75+",1,"Male"]
[null,1,"Male",9,"60-64",13,"$30,000-$32,499",287,3,"40-75+",1,"Male"]
[null,1,"Male",10,"65-69",13,"$30,000-$32,499",244,3,"40-75+",1,"Male"]
[null,1,"Male",11,"70-74",13,"$30,000-$32,499",201,3,"40-75+",1,"Male"]
[null,1,"Male",12,"75+",13,"$30,000-$32,499",394,3,"40-75+",1,"Male"]
[null,1,"Male",1,"15-24",14,"$32,500-$34,999",156,1,"15-24",1,"Male"]
[null,1,"Male",2,"25-29",14,"$32,500-$34,999",253,2,"25-39",1,"Male"]
[null,1,"Male",3,"30-34",14,"$32,500-$34,999",167,2,"25-39",1,"Male"]
[null,1,"Male",4,"35-39",14,"$32,500-$34,999",168,2,"25-39",1,"Male"]
[null,1,"Male",5,"40-44",14,"$32,500-$34,999",165,3,"40-75+",1,"Male"]
[null,1,"Male",6,"45-49",14,"$32,500-$34,999",172,3,"40-75+",1,"Male"]
[null,1,"Male",7,"50-54",14,"$32,500-$34,999",193,3,"40-75+",1,"Male"]
[null,1,"Male",8,"55-59",14,"$32,500-$34,999",151,3,"40-75+",1,"Male"]
[null,1,"Male",9,"60-64",14,"$32,500-$34,999",139,3,"40-75+",1,"Male"]
[null,1,"Male",10,"65-69",14,"$32,500-$34,999",177,3,"40-75+",1,"Male"]
[null,1,"Male",11,"70-74",14,"$32,500-$34,999",131,3,"40-75+",1,"Male"]
[null,1,"Male",12,"75+",14,"$32,500-$34,999",257,3,"40-75+",1,"Male"]
[null,1,"Male",1,"15-24",15,"$35,000-$37,499",297,1,"15-24",1,"Male"]
[null,1,"Male",2,"25-29",15,"$35,000-$37,499",593,2,"25-39",1,"Male"]
[null,1,"Male",3,"30-34",15,"$35,000-$37,499",502,2,"25-39",1,"Male"]
[null,1,"Male",4,"35-39",15,"$35,000-$37,499",368,2,"25-39",1,"Male"]
[null,1,"Male",5,"40-44",15,"$35,000-$37,499",346,3,"40-75+",1,"Male"]
[null,1,"Male",6,"45-49",15,"$35,000-$37,499",329,3,"40-75+",1,"Male"]
[null,1,"Male",7,"50-54",15,"$35,000-$37,499",399,3,"40-75+",1,"Male"]
[null,1,"Male",8,"55-59",15,"$35,000-$37,499",315,3,"40-75+",1,"Male"]
[null,1,"Male",9,"60-64",15,"$35,000-$37,499",253,3,"40-75+",1,"Male"]
[null,1,"Male",10,"65-69",15,"$35,000-$37,499",245,3,"40-75+",1,"Male"]
[null,1,"Male",11,"70-74",15,"$35,000-$37,499",180,3,"40-75+",1,"Male"]
[null,1,"Male",12,"75+",15,"$35,000-$37,499",272,3,"40-75+",1,"Male"]
[null,1,"Male",1,"15-24",16,"$37,500-$39,999",69,1,"15-24",1,"Male"]
[null,1,"Male",2,"25-29",16,"$37,500-$39,999",199,2,"25-39",1,"Male"]
[null,1,"Male",3,"30-34",16,"$37,500-$39,999",176,2,"25-39",1,"Male"]
[null,1,"Male",4,"35-39",16,"$37,500-$39,999",176,2,"25-39",1,"Male"]
[null,1,"Male",5,"40-44",16,"$37,500-$39,999",133,3,"40-75+",1,"Male"]
[null,1,"Male",6,"45-49",16,"$37,500-$39,999",150,3,"40-75+",1,"Male"]
[null,1,"Male",7,"50-54",16,"$37,500-$39,999",168,3,"40-75+",1,"Male"]
[null,1,"Male",8,"55-59",16,"$37,500-$39,999",146,3,"40-75+",1,"Male"]
[null,1,"Male",9,"60-64",16,"$37,500-$39,999",136,3,"40-75+",1,"Male"]
[null,1,"Male",10,"65-69",16,"$37,500-$39,999",163,3,"40-75+",1,"Male"]
[null,1,"Male",11,"70-74",16,"$37,500-$39,999",120,3,"40-75+",1,"Male"]
[null,1,"Male",12,"75+",16,"$37,500-$39,999",195,3,"40-75+",1,"Male"]
[null,1,"Male",1,"15-24",17,"$40,000-$42,499",266,{"$f":"VLOOKUP(D198,AgeOrderTable,2)","v":1},{"$f":"VLOOKUP(D198,AgeOrderTable,3)","v":"15-24"},{"$f":"VLOOKUP(B198,GenderOrderTable,2)","v":1},{"$f":"VLOOKUP(B198,GenderOrderTable,3)","v":"Male"}]
[null,1,"Male",2,"25-29",17,"$40,000-$42,499",663,2,"25-39",1,"Male"]
[null,1,"Male",3,"30-34",17,"$40,000-$42,499",531,2,"25-39",1,"Male"]
[null,1,"Male",4,"35-39",17,"$40,000-$42,499",433,2,"25-39",1,"Male"]
[null,1,"Male",5,"40-44",17,"$40,000-$42,499",390,3,"40-75+",1,"Male"]
[null,1,"Male",6,"45-49",17,"$40,000-$42,499",409,3,"40-75+",1,"Male"]
[null,1,"Male",7,"50-54",17,"$40,000-$42,499",444,3,"40-75+",1,"Male"]
[null,1,"Male",8,"55-59",17,"$40,000-$42,499",371,3,"40-75+",1,"Male"]
[null,1,"Male",9,"60-64",17,"$40,000-$42,499",365,3,"40-75+",1,"Male"]
[null,1,"Male",10,"65-69",17,"$40,000-$42,499",204,3,"40-75+",1,"Male"]
[null,1,"Male",11,"70-74",17,"$40,000-$42,499",133,3,"40-75+",1,"Male"]
[null,1,"Male",12,"75+",17,"$40,000-$42,499",210,3,"40-75+",1,"Male"]
[null,1,"Male",1,"15-24",18,"$42,500-$44,999",74,1,"15-24",1,"Male"]
[null,1,"Male",2,"25-29",18,"$42,500-$44,999",139,2,"25-39",1,"Male"]
[null,1,"Male",3,"30-34",18,"$42,500-$44,999",155,2,"25-39",1,"Male"]
[null,1,"Male",4,"35-39",18,"$42,500-$44,999",169,2,"25-39",1,"Male"]
[null,1,"Male",5,"40-44",18,"$42,500-$44,999",122,3,"40-75+",1,"Male"]
[null,1,"Male",6,"45-49",18,"$42,500-$44,999",141,3,"40-75+",1,"Male"]
[null,1,"Male",7,"50-54",18,"$42,500-$44,999",110,3,"40-75+",1,"Male"]
[null,1,"Male",8,"55-59",18,"$42,500-$44,999",135,3,"40-75+",1,"Male"]
[null,1,"Male",9,"60-64",18,"$42,500-$44,999",144,3,"40-75+",1,"Male"]
[null,1,"Male",10,"65-69",18,"$42,500-$44,999",135,3,"40-75+",1,"Male"]
[null,1,"Male",11,"70-74",18,"$42,500-$44,999",115,3,"40-75+",1,"Male"]
[null,1,"Male",12,"75+",18,"$42,500-$44,999",161,3,"40-75+",1,"Male"]
[null,1,"Male",1,"15-24",19,"$45,000-$47,499",148,1,"15-24",1,"Male"]
[null,1,"Male",2,"25-29",19,"$45,000-$47,499",383,2,"25-39",1,"Male"]
[null,1,"Male",3,"30-34",19,"$45,000-$47,499",377,2,"25-39",1,"Male"]
[null,1,"Male",4,"35-39",19,"$45,000-$47,499",355,2,"25-39",1,"Male"]
[null,1,"Male",5,"40-44",19,"$45,000-$47,499",298,3,"40-75+",1,"Male"]
[null,1,"Male",6,"45-49",19,"$45,000-$47,499",288,3,"40-75+",1,"Male"]
[null,1,"Male",7,"50-54",19,"$45,000-$47,499",267,3,"40-75+",1,"Male"]
[null,1,"Male",8,"55-59",19,"$45,000-$47,499",288,3,"40-75+",1,"Male"]
[null,1,"Male",9,"60-64",19,"$45,000-$47,499",201,3,"40-75+",1,"Male"]
[null,1,"Male",10,"65-69",19,"$45,000-$47,499",133,3,"40-75+",1,"Male"]
[null,1,"Male",11,"70-74",19,"$45,000-$47,499",99,3,"40-75+",1,"Male"]
[null,1,"Male",12,"75+",19,"$45,000-$47,499",160,3,"40-75+",1,"Male"]
[null,1,"Male",1,"15-24",20,"$47,500-$49,999",91,1,"15-24",1,"Male"]
[null,1,"Male",2,"25-29",20,"$47,500-$49,999",148,2,"25-39",1,"Male"]
[null,1,"Male",3,"30-34",20,"$47,500-$49,999",192,2,"25-39",1,"Male"]
[null,1,"Male",4,"35-39",20,"$47,500-$49,999",162,2,"25-39",1,"Male"]
[null,1,"Male",5,"40-44",20,"$47,500-$49,999",148,3,"40-75+",1,"Male"]
[null,1,"Male",6,"45-49",20,"$47,500-$49,999",172,3,"40-75+",1,"Male"]
[null,1,"Male",7,"50-54",20,"$47,500-$49,999",140,3,"40-75+",1,"Male"]
[null,1,"Male",8,"55-59",20,"$47,500-$49,999",136,3,"40-75+",1,"Male"]
[null,1,"Male",9,"60-64",20,"$47,500-$49,999",126,3,"40-75+",1,"Male"]
[null,1,"Male",10,"65-69",20,"$47,500-$49,999",142,3,"40-75+",1,"Male"]
[null,1,"Male",11,"70-74",20,"$47,500-$49,999",86,3,"40-75+",1,"Male"]
[null,1,"Male",12,"75+",20,"$47,500-$49,999",154,3,"40-75+",1,"Male"]
[null,1,"Male",1,"15-24",21,"$50,000-$52,499",219,1,"15-24",1,"Male"]
[null,1,"Male",2,"25-29",21,"$50,000-$52,499",458,2,"25-39",1,"Male"]
[null,1,"Male",3,"30-34",21,"$50,000-$52,499",496,2,"25-39",1,"Male"]
[null,1,"Male",4,"35-39",21,"$50,000-$52,499",401,2,"25-39",1,"Male"]
[null,1,"Male",5,"40-44",21,"$50,000-$52,499",388,3,"40-75+",1,"Male"]
[null,1,"Male",6,"45-49",21,"$50,000-$52,499",427,3,"40-75+",1,"Male"]
[null,1,"Male",7,"50-54",21,"$50,000-$52,499",451,3,"40-75+",1,"Male"]
[null,1,"Male",8,"55-59",21,"$50,000-$52,499",416,3,"40-75+",1,"Male"]
[null,1,"Male",9,"60-64",21,"$50,000-$52,499",371,3,"40-75+",1,"Male"]
[null,1,"Male",10,"65-69",21,"$50,000-$52,499",225,3,"40-75+",1,"Male"]
[null,1,"Male",11,"70-74",21,"$50,000-$52,499",93,3,"40-75+",1,"Male"]
[null,1,"Male",12,"75+",21,"$50,000-$52,499",147,3,"40-75+",1,"Male"]
[null,1,"Male",1,"15-24",22,"$52,500-$54,999",24,1,"15-24",1,"Male"]
[null,1,"Male",2,"25-29",22,"$52,500-$54,999",136,2,"25-39",1,"Male"]
[null,1,"Male",3,"30-34",22,"$52,500-$54,999",137,2,"25-39",1,"Male"]
[null,1,"Male",4,"35-39",22,"$52,500-$54,999",146,2,"25-39",1,"Male"]
[null,1,"Male",5,"40-44",22,"$52,500-$54,999",124,{"$f":"VLOOKUP(D262,AgeOrderTable,2)","v":3},{"$f":"VLOOKUP(D262,AgeOrderTable,3)","v":"40-75+"},{"$f":"VLOOKUP(B262,GenderOrderTable,2)","v":1},{"$f":"VLOOKUP(B262,GenderOrderTable,3)","v":"Male"}]
[null,1,"Male",6,"45-49",22,"$52,500-$54,999",118,3,"40-75+",1,"Male"]
[null,1,"Male",7,"50-54",22,"$52,500-$54,999",109,3,"40-75+",1,"Male"]
[null,1,"Male",8,"55-59",22,"$52,500-$54,999",196,3,"40-75+",1,"Male"]
[null,1,"Male",9,"60-64",22,"$52,500-$54,999",117,3,"40-75+",1,"Male"]
[null,1,"Male",10,"65-69",22,"$52,500-$54,999",144,3,"40-75+",1,"Male"]
[null,1,"Male",11,"70-74",22,"$52,500-$54,999",66,3,"40-75+",1,"Male"]
[null,1,"Male",12,"75+",22,"$52,500-$54,999",101,3,"40-75+",1,"Male"]
[null,1,"Male",1,"15-24",23,"$55,000-$57,499",93,1,"15-24",1,"Male"]
[null,1,"Male",2,"25-29",23,"$55,000-$57,499",241,2,"25-39",1,"Male"]
[null,1,"Male",3,"30-34",23,"$55,000-$57,499",275,2,"25-39",1,"Male"]
[null,1,"Male",4,"35-39",23,"$55,000-$57,499",234,2,"25-39",1,"Male"]
[null,1,"Male",5,"40-44",23,"$55,000-$57,499",213,3,"40-75+",1,"Male"]
[null,1,"Male",6,"45-49",23,"$55,000-$57,499",174,3,"40-75+",1,"Male"]
[null,1,"Male",7,"50-54",23,"$55,000-$57,499",239,3,"40-75+",1,"Male"]
[null,1,"Male",8,"55-59",23,"$55,000-$57,499",200,3,"40-75+",1,"Male"]
[null,1,"Male",9,"60-64",23,"$55,000-$57,499",176,3,"40-75+",1,"Male"]
[null,1,"Male",10,"65-69",23,"$55,000-$57,499",174,3,"40-75+",1,"Male"]
[null,1,"Male",11,"70-74",23,"$55,000-$57,499",74,3,"40-75+",1,"Male"]
[null,1,"Male",12,"75+",23,"$55,000-$57,499",103,3,"40-75+",1,"Male"]
[null,1,"Male",1,"15-24",24,"$57,500-$59,999",42,1,"15-24",1,"Male"]
[null,1,"Male",2,"25-29",24,"$57,500-$59,999",86,2,"25-39",1,"Male"]
[null,1,"Male",3,"30-34",24,"$57,500-$59,999",125,2,"25-39",1,"Male"]
[null,1,"Male",4,"35-39",24,"$57,500-$59,999",100,2,"25-39",1,"Male"]
[null,1,"Male",5,"40-44",24,"$57,500-$59,999",93,3,"40-75+",1,"Male"]
[null,1,"Male",6,"45-49",24,"$57,500-$59,999",93,3,"40-75+",1,"Male"]
[null,1,"Male",7,"50-54",24,"$57,500-$59,999",92,3,"40-75+",1,"Male"]
[null,1,"Male",8,"55-59",24,"$57,500-$59,999",135,3,"40-75+",1,"Male"]
[null,1,"Male",9,"60-64",24,"$57,500-$59,999",117,3,"40-75+",1,"Male"]
[null,1,"Male",10,"65-69",24,"$57,500-$59,999",122,3,"40-75+",1,"Male"]
[null,1,"Male",11,"70-74",24,"$57,500-$59,999",63,3,"40-75+",1,"Male"]
[null,1,"Male",12,"75+",24,"$57,500-$59,999",58,3,"40-75+",1,"Male"]
[null,1,"Male",1,"15-24",25,"$60,000-$62,499",81,1,"15-24",1,"Male"]
[null,1,"Male",2,"25-29",25,"$60,000-$62,499",260,2,"25-39",1,"Male"]
[null,1,"Male",3,"30-34",25,"$60,000-$62,499",323,2,"25-39",1,"Male"]
[null,1,"Male",4,"35-39",25,"$60,000-$62,499",380,2,"25-39",1,"Male"]
[null,1,"Male",5,"40-44",25,"$60,000-$62,499",369,3,"40-75+",1,"Male"]
[null,1,"Male",6,"45-49",25,"$60,000-$62,499",321,3,"40-75+",1,"Male"]
[null,1,"Male",7,"50-54",25,"$60,000-$62,499",412,3,"40-75+",1,"Male"]
[null,1,"Male",8,"55-59",25,"$60,000-$62,499",283,3,"40-75+",1,"Male"]
[null,1,"Male",9,"60-64",25,"$60,000-$62,499",227,3,"40-75+",1,"Male"]
[null,1,"Male",10,"65-69",25,"$60,000-$62,499",126,3,"40-75+",1,"Male"]
[null,1,"Male",11,"70-74",25,"$60,000-$62,499",92,3,"40-75+",1,"Male"]
[null,1,"Male",12,"75+",25,"$60,000-$62,499",121,3,"40-75+",1,"Male"]
[null,1,"Male",1,"15-24",26,"$62,500-$64,999",21,1,"15-24",1,"Male"]
[null,1,"Male",2,"25-29",26,"$62,500-$64,999",64,2,"25-39",1,"Male"]
[null,1,"Male",3,"30-34",26,"$62,500-$64,999",112,2,"25-39",1,"Male"]
[null,1,"Male",4,"35-39",26,"$62,500-$64,999",90,2,"25-39",1,"Male"]
[null,1,"Male",5,"40-44",26,"$62,500-$64,999",98,3,"40-75+",1,"Male"]
[null,1,"Male",6,"45-49",26,"$62,500-$64,999",98,3,"40-75+",1,"Male"]
[null,1,"Male",7,"50-54",26,"$62,500-$64,999",115,3,"40-75+",1,"Male"]
[null,1,"Male",8,"55-59",26,"$62,500-$64,999",139,3,"40-75+",1,"Male"]
[null,1,"Male",9,"60-64",26,"$62,500-$64,999",84,3,"40-75+",1,"Male"]
[null,1,"Male",10,"65-69",26,"$62,500-$64,999",109,3,"40-75+",1,"Male"]
[null,1,"Male",11,"70-74",26,"$62,500-$64,999",73,3,"40-75+",1,"Male"]
[null,1,"Male",12,"75+",26,"$62,500-$64,999",89,3,"40-75+",1,"Male"]
[null,1,"Male",1,"15-24",27,"$65,000-$67,499",45,1,"15-24",1,"Male"]
[null,1,"Male",2,"25-29",27,"$65,000-$67,499",174,2,"25-39",1,"Male"]
[null,1,"Male",3,"30-34",27,"$65,000-$67,499",241,2,"25-39",1,"Male"]
[null,1,"Male",4,"35-39",27,"$65,000-$67,499",190,2,"25-39",1,"Male"]
[null,1,"Male",5,"40-44",27,"$65,000-$67,499",210,3,"40-75+",1,"Male"]
[null,1,"Male",6,"45-49",27,"$65,000-$67,499",252,3,"40-75+",1,"Male"]
[null,1,"Male",7,"50-54",27,"$65,000-$67,499",220,3,"40-75+",1,"Male"]
[null,1,"Male",8,"55-59",27,"$65,000-$67,499",191,3,"40-75+",1,"Male"]
[null,1,"Male",9,"60-64",27,"$65,000-$67,499",176,{"$f":"VLOOKUP(D326,AgeOrderTable,2)","v":3},{"$f":"VLOOKUP(D326,AgeOrderTable,3)","v":"40-75+"},{"$f":"VLOOKUP(B326,GenderOrderTable,2)","v":1},{"$f":"VLOOKUP(B326,GenderOrderTable,3)","v":"Male"}]
[null,1,"Male",10,"65-69",27,"$65,000-$67,499",127,3,"40-75+",1,"Male"]
[null,1,"Male",11,"70-74",27,"$65,000-$67,499",88,3,"40-75+",1,"Male"]
[null,1,"Male",12,"75+",27,"$65,000-$67,499",71,3,"40-75+",1,"Male"]
[null,1,"Male",1,"15-24",28,"$67,500-$69,999",16,1,"15-24",1,"Male"]
[null,1,"Male",2,"25-29",28,"$67,500-$69,999",70,2,"25-39",1,"Male"]
[null,1,"Male",3,"30-34",28,"$67,500-$69,999",78,2,"25-39",1,"Male"]
[null,1,"Male",4,"35-39",28,"$67,500-$69,999",77,2,"25-39",1,"Male"]
[null,1,"Male",5,"40-44",28,"$67,500-$69,999",86,3,"40-75+",1,"Male"]
[null,1,"Male",6,"45-49",28,"$67,500-$69,999",102,3,"40-75+",1,"Male"]
[null,1,"Male",7,"50-54",28,"$67,500-$69,999",74,3,"40-75+",1,"Male"]
[null,1,"Male",8,"55-59",28,"$67,500-$69,999",84,3,"40-75+",1,"Male"]
[null,1,"Male",9,"60-64",28,"$67,500-$69,999",86,3,"40-75+",1,"Male"]
[null,1,"Male",10,"65-69",28,"$67,500-$69,999",88,3,"40-75+",1,"Male"]
[null,1,"Male",11,"70-74",28,"$67,500-$69,999",73,3,"40-75+",1,"Male"]
[null,1,"Male",12,"75+",28,"$67,500-$69,999",50,3,"40-75+",1,"Male"]
[null,1,"Male",1,"15-24",29,"$70,000-$72,499",38,1,"15-24",1,"Male"]
[null,1,"Male",2,"25-29",29,"$70,000-$72,499",170,2,"25-39",1,"Male"]
[null,1,"Male",3,"30-34",29,"$70,000-$72,499",213,2,"25-39",1,"Male"]
[null,1,"Male",4,"35-39",29,"$70,000-$72,499",232,2,"25-39",1,"Male"]
[null,1,"Male",5,"40-44",29,"$70,000-$72,499",230,3,"40-75+",1,"Male"]
[null,1,"Male",6,"45-49",29,"$70,000-$72,499",230,3,"40-75+",1,"Male"]
[null,1,"Male",7,"50-54",29,"$70,000-$72,499",269,3,"40-75+",1,"Male"]
[null,1,"Male",8,"55-59",29,"$70,000-$72,499",225,3,"40-75+",1,"Male"]
[null,1,"Male",9,"60-64",29,"$70,000-$72,499",166,3,"40-75+",1,"Male"]
[null,1,"Male",10,"65-69",29,"$70,000-$72,499",101,3,"40-75+",1,"Male"]
[null,1,"Male",11,"70-74",29,"$70,000-$72,499",59,3,"40-75+",1,"Male"]
[null,1,"Male",12,"75+",29,"$70,000-$72,499",67,3,"40-75+",1,"Male"]
[null,1,"Male",1,"15-24",30,"$72,500-$74,999",17,1,"15-24",1,"Male"]
[null,1,"Male",2,"25-29",30,"$72,500-$74,999",86,2,"25-39",1,"Male"]
[null,1,"Male",3,"30-34",30,"$72,500-$74,999",82,2,"25-39",1,"Male"]
[null,1,"Male",4,"35-39",30,"$72,500-$74,999",85,2,"25-39",1,"Male"]
[null,1,"Male",5,"40-44",30,"$72,500-$74,999",83,3,"40-75+",1,"Male"]
[null,1,"Male",6,"45-49",30,"$72,500-$74,999",56,3,"40-75+",1,"Male"]
[null,1,"Male",7,"50-54",30,"$72,500-$74,999",86,3,"40-75+",1,"Male"]
[null,1,"Male",8,"55-59",30,"$72,500-$74,999",114,3,"40-75+",1,"Male"]
[null,1,"Male",9,"60-64",30,"$72,500-$74,999",79,3,"40-75+",1,"Male"]
[null,1,"Male",10,"65-69",30,"$72,500-$74,999",95,3,"40-75+",1,"Male"]
[null,1,"Male",11,"70-74",30,"$72,500-$74,999",34,3,"40-75+",1,"Male"]
[null,1,"Male",12,"75+",30,"$72,500-$74,999",61,3,"40-75+",1,"Male"]
[null,1,"Male",1,"15-24",31,"$75,000-$77,499",43,1,"15-24",1,"Male"]
[null,1,"Male",2,"25-29",31,"$75,000-$77,499",138,2,"25-39",1,"Male"]
[null,1,"Male",3,"30-34",31,"$75,000-$77,499",170,2,"25-39",1,"Male"]
[null,1,"Male",4,"35-39",31,"$75,000-$77,499",224,2,"25-39",1,"Male"]
[null,1,"Male",5,"40-44",31,"$75,000-$77,499",220,3,"40-75+",1,"Male"]
[null,1,"Male",6,"45-49",31,"$75,000-$77,499",198,3,"40-75+",1,"Male"]
[null,1,"Male",7,"50-54",31,"$75,000-$77,499",232,3,"40-75+",1,"Male"]
[null,1,"Male",8,"55-59",31,"$75,000-$77,499",195,3,"40-75+",1,"Male"]
[null,1,"Male",9,"60-64",31,"$75,000-$77,499",149,3,"40-75+",1,"Male"]
[null,1,"Male",10,"65-69",31,"$75,000-$77,499",88,3,"40-75+",1,"Male"]
[null,1,"Male",11,"70-74",31,"$75,000-$77,499",50,3,"40-75+",1,"Male"]
[null,1,"Male",12,"75+",31,"$75,000-$77,499",56,3,"40-75+",1,"Male"]
[null,1,"Male",1,"15-24",32,"$77,500-$79,999",14,1,"15-24",1,"Male"]
[null,1,"Male",2,"25-29",32,"$77,500-$79,999",54,2,"25-39",1,"Male"]
[null,1,"Male",3,"30-34",32,"$77,500-$79,999",93,2,"25-39",1,"Male"]
[null,1,"Male",4,"35-39",32,"$77,500-$79,999",113,2,"25-39",1,"Male"]
[null,1,"Male",5,"40-44",32,"$77,500-$79,999",85,3,"40-75+",1,"Male"]
[null,1,"Male",6,"45-49",32,"$77,500-$79,999",83,3,"40-75+",1,"Male"]
[null,1,"Male",7,"50-54",32,"$77,500-$79,999",63,3,"40-75+",1,"Male"]
[null,1,"Male",8,"55-59",32,"$77,500-$79,999",89,3,"40-75+",1,"Male"]
[null,1,"Male",9,"60-64",32,"$77,500-$79,999",65,3,"40-75+",1,"Male"]
[null,1,"Male",10,"65-69",32,"$77,500-$79,999",72,3,"40-75+",1,"Male"]
[null,1,"Male",11,"70-74",32,"$77,500-$79,999",32,3,"40-75+",1,"Male"]
[null,1,"Male",12,"75+",32,"$77,500-$79,999",54,3,"40-75+",1,"Male"]
[null,1,"Male",1,"15-24",33,"$80,000-$82,499",25,{"$f":"VLOOKUP(D390,AgeOrderTable,2)","v":1},{"$f":"VLOOKUP(D390,AgeOrderTable,3)","v":"15-24"},{"$f":"VLOOKUP(B390,GenderOrderTable,2)","v":1},{"$f":"VLOOKUP(B390,GenderOrderTable,3)","v":"Male"}]
[null,1,"Male",2,"25-29",33,"$80,000-$82,499",156,2,"25-39",1,"Male"]
[null,1,"Male",3,"30-34",33,"$80,000-$82,499",217,2,"25-39",1,"Male"]
[null,1,"Male",4,"35-39",33,"$80,000-$82,499",196,2,"25-39",1,"Male"]
[null,1,"Male",5,"40-44",33,"$80,000-$82,499",195,3,"40-75+",1,"Male"]
[null,1,"Male",6,"45-49",33,"$80,000-$82,499",237,3,"40-75+",1,"Male"]
[null,1,"Male",7,"50-54",33,"$80,000-$82,499",231,3,"40-75+",1,"Male"]
[null,1,"Male",8,"55-59",33,"$80,000-$82,499",242,3,"40-75+",1,"Male"]
[null,1,"Male",9,"60-64",33,"$80,000-$82,499",177,3,"40-75+",1,"Male"]
[null,1,"Male",10,"65-69",33,"$80,000-$82,499",75,3,"40-75+",1,"Male"]
[null,1,"Male",11,"70-74",33,"$80,000-$82,499",37,3,"40-75+",1,"Male"]
[null,1,"Male",12,"75+",33,"$80,000-$82,499",49,3,"40-75+",1,"Male"]
[null,1,"Male",1,"15-24",34,"$82,500-$84,999",2,1,"15-24",1,"Male"]
[null,1,"Male",2,"25-29",34,"$82,500-$84,999",30,2,"25-39",1,"Male"]
[null,1,"Male",3,"30-34",34,"$82,500-$84,999",61,2,"25-39",1,"Male"]
[null,1,"Male",4,"35-39",34,"$82,500-$84,999",41,2,"25-39",1,"Male"]
[null,1,"Male",5,"40-44",34,"$82,500-$84,999",67,3,"40-75+",1,"Male"]
[null,1,"Male",6,"45-49",34,"$82,500-$84,999",63,3,"40-75+",1,"Male"]
[null,1,"Male",7,"50-54",34,"$82,500-$84,999",79,3,"40-75+",1,"Male"]
[null,1,"Male",8,"55-59",34,"$82,500-$84,999",65,3,"40-75+",1,"Male"]
[null,1,"Male",9,"60-64",34,"$82,500-$84,999",50,3,"40-75+",1,"Male"]
[null,1,"Male",10,"65-69",34,"$82,500-$84,999",71,3,"40-75+",1,"Male"]
[null,1,"Male",11,"70-74",34,"$82,500-$84,999",32,3,"40-75+",1,"Male"]
[null,1,"Male",12,"75+",34,"$82,500-$84,999",24,3,"40-75+",1,"Male"]
[null,1,"Male",1,"15-24",35,"$85,000-$87,499",8,1,"15-24",1,"Male"]
[null,1,"Male",2,"25-29",35,"$85,000-$87,499",49,2,"25-39",1,"Male"]
[null,1,"Male",3,"30-34",35,"$85,000-$87,499",90,2,"25-39",1,"Male"]
[null,1,"Male",4,"35-39",35,"$85,000-$87,499",110,2,"25-39",1,"Male"]
[null,1,"Male",5,"40-44",35,"$85,000-$87,499",126,3,"40-75+",1,"Male"]
[null,1,"Male",6,"45-49",35,"$85,000-$87,499",176,3,"40-75+",1,"Male"]
[null,1,"Male",7,"50-54",35,"$85,000-$87,499",130,3,"40-75+",1,"Male"]
[null,1,"Male",8,"55-59",35,"$85,000-$87,499",125,3,"40-75+",1,"Male"]
[null,1,"Male",9,"60-64",35,"$85,000-$87,499",86,3,"40-75+",1,"Male"]
[null,1,"Male",10,"65-69",35,"$85,000-$87,499",58,3,"40-75+",1,"Male"]
[null,1,"Male",11,"70-74",35,"$85,000-$87,499",30,3,"40-75+",1,"Male"]
[null,1,"Male",12,"75+",35,"$85,000-$87,499",14,3,"40-75+",1,"Male"]
[null,1,"Male",1,"15-24",36,"$87,500-$89,999",1,1,"15-24",1,"Male"]
[null,1,"Male",2,"25-29",36,"$87,500-$89,999",36,2,"25-39",1,"Male"]
[null,1,"Male",3,"30-34",36,"$87,500-$89,999",34,2,"25-39",1,"Male"]
[null,1,"Male",4,"35-39",36,"$87,500-$89,999",85,2,"25-39",1,"Male"]
[null,1,"Male",5,"40-44",36,"$87,500-$89,999",46,3,"40-75+",1,"Male"]
[null,1,"Male",6,"45-49",36,"$87,500-$89,999",67,3,"40-75+",1,"Male"]
[null,1,"Male",7,"50-54",36,"$87,500-$89,999",52,3,"40-75+",1,"Male"]
[null,1,"Male",8,"55-59",36,"$87,500-$89,999",39,3,"40-75+",1,"Male"]
[null,1,"Male",9,"60-64",36,"$87,500-$89,999",41,3,"40-75+",1,"Male"]
[null,1,"Male",10,"65-69",36,"$87,500-$89,999",58,3,"40-75+",1,"Male"]
[null,1,"Male",11,"70-74",36,"$87,500-$89,999",32,3,"40-75+",1,"Male"]
[null,1,"Male",12,"75+",36,"$87,500-$89,999",33,3,"40-75+",1,"Male"]
[null,1,"Male",1,"15-24",37,"$90,000-$92,499",10,1,"15-24",1,"Male"]
[null,1,"Male",2,"25-29",37,"$90,000-$92,499",96,2,"25-39",1,"Male"]
[null,1,"Male",3,"30-34",37,"$90,000-$92,499",137,2,"25-39",1,"Male"]
[null,1,"Male",4,"35-39",37,"$90,000-$92,499",131,2,"25-39",1,"Male"]
[null,1,"Male",5,"40-44",37,"$90,000-$92,499",158,3,"40-75+",1,"Male"]
[null,1,"Male",6,"45-49",37,"$90,000-$92,499",164,3,"40-75+",1,"Male"]
[null,1,"Male",7,"50-54",37,"$90,000-$92,499",170,3,"40-75+",1,"Male"]
[null,1,"Male",8,"55-59",37,"$90,000-$92,499",118,3,"40-75+",1,"Male"]
[null,1,"Male",9,"60-64",37,"$90,000-$92,499",143,3,"40-75+",1,"Male"]
[null,1,"Male",10,"65-69",37,"$90,000-$92,499",53,3,"40-75+",1,"Male"]
[null,1,"Male",11,"70-74",37,"$90,000-$92,499",56,3,"40-75+",1,"Male"]
[null,1,"Male",12,"75+",37,"$90,000-$92,499",38,3,"40-75+",1,"Male"]
[null,1,"Male",1,"15-24",38,"$92,500-$94,999",4,1,"15-24",1,"Male"]
[null,1,"Male",2,"25-29",38,"$92,500-$94,999",35,2,"25-39",1,"Male"]
[null,1,"Male",3,"30-34",38,"$92,500-$94,999",25,2,"25-39",1,"Male"]
[null,1,"Male",4,"35-39",38,"$92,500-$94,999",39,2,"25-39",1,"Male"]
[null,1,"Male",5,"40-44",38,"$92,500-$94,999",48,{"$f":"VLOOKUP(D454,AgeOrderTable,2)","v":3},{"$f":"VLOOKUP(D454,AgeOrderTable,3)","v":"40-75+"},{"$f":"VLOOKUP(B454,GenderOrderTable,2)","v":1},{"$f":"VLOOKUP(B454,GenderOrderTable,3)","v":"Male"}]
[null,1,"Male",6,"45-49",38,"$92,500-$94,999",35,3,"40-75+",1,"Male"]
[null,1,"Male",7,"50-54",38,"$92,500-$94,999",63,3,"40-75+",1,"Male"]
[null,1,"Male",8,"55-59",38,"$92,500-$94,999",58,3,"40-75+",1,"Male"]
[null,1,"Male",9,"60-64",38,"$92,500-$94,999",46,3,"40-75+",1,"Male"]
[null,1,"Male",10,"65-69",38,"$92,500-$94,999",47,3,"40-75+",1,"Male"]
[null,1,"Male",11,"70-74",38,"$92,500-$94,999",21,3,"40-75+",1,"Male"]
[null,1,"Male",12,"75+",38,"$92,500-$94,999",36,3,"40-75+",1,"Male"]
[null,1,"Male",1,"15-24",39,"$95,000-$97,499",12,1,"15-24",1,"Male"]
[null,1,"Male",2,"25-29",39,"$95,000-$97,499",41,2,"25-39",1,"Male"]
[null,1,"Male",3,"30-34",39,"$95,000-$97,499",76,2,"25-39",1,"Male"]
[null,1,"Male",4,"35-39",39,"$95,000-$97,499",121,2,"25-39",1,"Male"]
[null,1,"Male",5,"40-44",39,"$95,000-$97,499",90,3,"40-75+",1,"Male"]
[null,1,"Male",6,"45-49",39,"$95,000-$97,499",77,3,"40-75+",1,"Male"]
[null,1,"Male",7,"50-54",39,"$95,000-$97,499",82,3,"40-75+",1,"Male"]
[null,1,"Male",8,"55-59",39,"$95,000-$97,499",89,3,"40-75+",1,"Male"]
[null,1,"Male",9,"60-64",39,"$95,000-$97,499",58,3,"40-75+",1,"Male"]
[null,1,"Male",10,"65-69",39,"$95,000-$97,499",51,3,"40-75+",1,"Male"]
[null,1,"Male",11,"70-74",39,"$95,000-$97,499",22,3,"40-75+",1,"Male"]
[null,1,"Male",12,"75+",39,"$95,000-$97,499",19,3,"40-75+",1,"Male"]
[null,1,"Male",1,"15-24",40,"$97,500-$99,999",13,1,"15-24",1,"Male"]
[null,1,"Male",2,"25-29",40,"$97,500-$99,999",25,2,"25-39",1,"Male"]
[null,1,"Male",3,"30-34",40,"$97,500-$99,999",24,2,"25-39",1,"Male"]
[null,1,"Male",4,"35-39",40,"$97,500-$99,999",43,2,"25-39",1,"Male"]
[null,1,"Male",5,"40-44",40,"$97,500-$99,999",40,3,"40-75+",1,"Male"]
[null,1,"Male",6,"45-49",40,"$97,500-$99,999",80,3,"40-75+",1,"Male"]
[null,1,"Male",7,"50-54",40,"$97,500-$99,999",55,3,"40-75+",1,"Male"]
[null,1,"Male",8,"55-59",40,"$97,500-$99,999",48,3,"40-75+",1,"Male"]
[null,1,"Male",9,"60-64",40,"$97,500-$99,999",57,3,"40-75+",1,"Male"]
[null,1,"Male",10,"65-69",40,"$97,500-$99,999",29,3,"40-75+",1,"Male"]
[null,1,"Male",11,"70-74",40,"$97,500-$99,999",29,3,"40-75+",1,"Male"]
[null,1,"Male",12,"75+",40,"$97,500-$99,999",43,3,"40-75+",1,"Male"]
[null,1,"Male",1,"15-24",41,"$100,000+",113,1,"15-24",1,"Male"]
[null,1,"Male",2,"25-29",41,"$100,000+",601,2,"25-39",1,"Male"]
[null,1,"Male",3,"30-34",41,"$100,000+",1067,2,"25-39",1,"Male"]
[null,1,"Male",4,"35-39",41,"$100,000+",1599,2,"25-39",1,"Male"]
[null,1,"Male",5,"40-44",41,"$100,000+",1739,3,"40-75+",1,"Male"]
[null,1,"Male",6,"45-49",41,"$100,000+",1925,3,"40-75+",1,"Male"]
[null,1,"Male",7,"50-54",41,"$100,000+",2070,3,"40-75+",1,"Male"]
[null,1,"Male",8,"55-59",41,"$100,000+",2027,3,"40-75+",1,"Male"]
[null,1,"Male",9,"60-64",41,"$100,000+",1458,3,"40-75+",1,"Male"]
[null,1,"Male",10,"65-69",41,"$100,000+",1170,3,"40-75+",1,"Male"]
[null,1,"Male",11,"70-74",41,"$100,000+",583,3,"40-75+",1,"Male"]
[null,1,"Male",12,"75+",41,"$100,000+",519,3,"40-75+",1,"Male"]
[null,2,"Female",1,"15-24",1,"0-$2,499",2813,1,"15-24",2,"Female"]
[null,2,"Female",2,"25-29",1,"0-$2,499",659,2,"25-39",2,"Female"]
[null,2,"Female",3,"30-34",1,"0-$2,499",846,2,"25-39",2,"Female"]
[null,2,"Female",4,"35-39",1,"0-$2,499",854,2,"25-39",2,"Female"]
[null,2,"Female",5,"40-44",1,"0-$2,499",743,3,"40-75+",2,"Female"]
[null,2,"Female",6,"45-49",1,"0-$2,499",773,3,"40-75+",2,"Female"]
[null,2,"Female",7,"50-54",1,"0-$2,499",772,3,"40-75+",2,"Female"]
[null,2,"Female",8,"55-59",1,"0-$2,499",900,3,"40-75+",2,"Female"]
[null,2,"Female",9,"60-64",1,"0-$2,499",766,3,"40-75+",2,"Female"]
[null,2,"Female",10,"65-69",1,"0-$2,499",309,3,"40-75+",2,"Female"]
[null,2,"Female",11,"70-74",1,"0-$2,499",99,3,"40-75+",2,"Female"]
[null,2,"Female",12,"75+",1,"0-$2,499",267,3,"40-75+",2,"Female"]
[null,2,"Female",1,"15-24",2,"$2,500-$4,999",1397,1,"15-24",2,"Female"]
[null,2,"Female",2,"25-29",2,"$2,500-$4,999",289,2,"25-39",2,"Female"]
[null,2,"Female",3,"30-34",2,"$2,500-$4,999",247,2,"25-39",2,"Female"]
[null,2,"Female",4,"35-39",2,"$2,500-$4,999",260,2,"25-39",2,"Female"]
[null,2,"Female",5,"40-44",2,"$2,500-$4,999",253,3,"40-75+",2,"Female"]
[null,2,"Female",6,"45-49",2,"$2,500-$4,999",222,3,"40-75+",2,"Female"]
[null,2,"Female",7,"50-54",2,"$2,500-$4,999",238,3,"40-75+",2,"Female"]
[null,2,"Female",8,"55-59",2,"$2,500-$4,999",201,3,"40-75+",2,"Female"]
[null,2,"Female",9,"60-64",2,"$2,500-$4,999",253,{"$f":"VLOOKUP(D518,AgeOrderTable,2)","v":3},{"$f":"VLOOKUP(D518,AgeOrderTable,3)","v":"40-75+"},{"$f":"VLOOKUP(B518,GenderOrderTable,2)","v":2},{"$f":"VLOOKUP(B518,GenderOrderTable,3)","v":"Female"}]
[null,2,"Female",10,"65-69",2,"$2,500-$4,999",172,3,"40-75+",2,"Female"]
[null,2,"Female",11,"70-74",2,"$2,500-$4,999",129,3,"40-75+",2,"Female"]
[null,2,"Female",12,"75+",2,"$2,500-$4,999",272,3,"40-75+",2,"Female"]
[null,2,"Female",1,"15-24",3,"$5,000-$7,499",1315,1,"15-24",2,"Female"]
[null,2,"Female",2,"25-29",3,"$5,000-$7,499",355,2,"25-39",2,"Female"]
[null,2,"Female",3,"30-34",3,"$5,000-$7,499",291,2,"25-39",2,"Female"]
[null,2,"Female",4,"35-39",3,"$5,000-$7,499",308,2,"25-39",2,"Female"]
[null,2,"Female",5,"40-44",3,"$5,000-$7,499",274,3,"40-75+",2,"Female"]
[null,2,"Female",6,"45-49",3,"$5,000-$7,499",288,3,"40-75+",2,"Female"]
[null,2,"Female",7,"50-54",3,"$5,000-$7,499",292,3,"40-75+",2,"Female"]
[null,2,"Female",8,"55-59",3,"$5,000-$7,499",255,3,"40-75+",2,"Female"]
[null,2,"Female",9,"60-64",3,"$5,000-$7,499",376,3,"40-75+",2,"Female"]
[null,2,"Female",10,"65-69",3,"$5,000-$7,499",344,3,"40-75+",2,"Female"]
[null,2,"Female",11,"70-74",3,"$5,000-$7,499",304,3,"40-75+",2,"Female"]
[null,2,"Female",12,"75+",3,"$5,000-$7,499",602,3,"40-75+",2,"Female"]
[null,2,"Female",1,"15-24",4,"$7,500-$9,999",1004,1,"15-24",2,"Female"]
[null,2,"Female",2,"25-29",4,"$7,500-$9,999",305,2,"25-39",2,"Female"]
[null,2,"Female",3,"30-34",4,"$7,500-$9,999",324,2,"25-39",2,"Female"]
[null,2,"Female",4,"35-39",4,"$7,500-$9,999",285,2,"25-39",2,"Female"]
[null,2,"Female",5,"40-44",4,"$7,500-$9,999",358,3,"40-75+",2,"Female"]
[null,2,"Female",6,"45-49",4,"$7,500-$9,999",364,3,"40-75+",2,"Female"]
[null,2,"Female",7,"50-54",4,"$7,500-$9,999",415,3,"40-75+",2,"Female"]
[null,2,"Female",8,"55-59",4,"$7,500-$9,999",517,3,"40-75+",2,"Female"]
[null,2,"Female",9,"60-64",4,"$7,500-$9,999",571,3,"40-75+",2,"Female"]
[null,2,"Female",10,"65-69",4,"$7,500-$9,999",730,3,"40-75+",2,"Female"]
[null,2,"Female",11,"70-74",4,"$7,500-$9,999",647,3,"40-75+",2,"Female"]
[null,2,"Female",12,"75+",4,"$7,500-$9,999",1241,3,"40-75+",2,"Female"]
[null,2,"Female",1,"15-24",5,"$10,000-$12,499",1372,1,"15-24",2,"Female"]
[null,2,"Female",2,"25-29",5,"$10,000-$12,499",549,2,"25-39",2,"Female"]
[null,2,"Female",3,"30-34",5,"$10,000-$12,499",393,2,"25-39",2,"Female"]
[null,2,"Female",4,"35-39",5,"$10,000-$12,499",403,2,"25-39",2,"Female"]
[null,2,"Female",5,"40-44",5,"$10,000-$12,499",371,3,"40-75+",2,"Female"]
[null,2,"Female",6,"45-49",5,"$10,000-$12,499",425,3,"40-75+",2,"Female"]
[null,2,"Female",7,"50-54",5,"$10,000-$12,499",503,3,"40-75+",2,"Female"]
[null,2,"Female",8,"55-59",5,"$10,000-$12,499",527,3,"40-75+",2,"Female"]
[null,2,"Female",9,"60-64",5,"$10,000-$12,499",599,3,"40-75+",2,"Female"]
[null,2,"Female",10,"65-69",5,"$10,000-$12,499",794,3,"40-75+",2,"Female"]
[null,2,"Female",11,"70-74",5,"$10,000-$12,499",686,3,"40-75+",2,"Female"]
[null,2,"Female",12,"75+",5,"$10,000-$12,499",1259,3,"40-75+",2,"Female"]
[null,2,"Female",1,"15-24",6,"$12,500-$14,999",644,1,"15-24",2,"Female"]
[null,2,"Female",2,"25-29",6,"$12,500-$14,999",336,2,"25-39",2,"Female"]
[null,2,"Female",3,"30-34",6,"$12,500-$14,999",248,2,"25-39",2,"Female"]
[null,2,"Female",4,"35-39",6,"$12,500-$14,999",256,2,"25-39",2,"Female"]
[null,2,"Female",5,"40-44",6,"$12,500-$14,999",263,3,"40-75+",2,"Female"]
[null,2,"Female",6,"45-49",6,"$12,500-$14,999",270,3,"40-75+",2,"Female"]
[null,2,"Female",7,"50-54",6,"$12,500-$14,999",296,3,"40-75+",2,"Female"]
[null,2,"Female",8,"55-59",6,"$12,500-$14,999",384,3,"40-75+",2,"Female"]
[null,2,"Female",9,"60-64",6,"$12,500-$14,999",452,3,"40-75+",2,"Female"]
[null,2,"Female",10,"65-69",6,"$12,500-$14,999",684,3,"40-75+",2,"Female"]
[null,2,"Female",11,"70-74",6,"$12,500-$14,999",534,3,"40-75+",2,"Female"]
[null,2,"Female",12,"75+",6,"$12,500-$14,999",1217,3,"40-75+",2,"Female"]
[null,2,"Female",1,"15-24",7,"$15,000-$17,499",813,1,"15-24",2,"Female"]
[null,2,"Female",2,"25-29",7,"$15,000-$17,499",522,2,"25-39",2,"Female"]
[null,2,"Female",3,"30-34",7,"$15,000-$17,499",387,2,"25-39",2,"Female"]
[null,2,"Female",4,"35-39",7,"$15,000-$17,499",374,2,"25-39",2,"Female"]
[null,2,"Female",5,"40-44",7,"$15,000-$17,499",383,3,"40-75+",2,"Female"]
[null,2,"Female",6,"45-49",7,"$15,000-$17,499",415,3,"40-75+",2,"Female"]
[null,2,"Female",7,"50-54",7,"$15,000-$17,499",391,3,"40-75+",2,"Female"]
[null,2,"Female",8,"55-59",7,"$15,000-$17,499",469,3,"40-75+",2,"Female"]
[null,2,"Female",9,"60-64",7,"$15,000-$17,499",413,3,"40-75+",2,"Female"]
[null,2,"Female",10,"65-69",7,"$15,000-$17,499",566,3,"40-75+",2,"Female"]
[null,2,"Female",11,"70-74",7,"$15,000-$17,499",355,3,"40-75+",2,"Female"]
[null,2,"Female",12,"75+",7,"$15,000-$17,499",942,3,"40-75+",2,"Female"]
[null,2,"Female",1,"15-24",8,"$17,500-$19,999",474,{"$f":"VLOOKUP(D582,AgeOrderTable,2)","v":1},{"$f":"VLOOKUP(D582,AgeOrderTable,3)","v":"15-24"},{"$f":"VLOOKUP(B582,GenderOrderTable,2)","v":2},{"$f":"VLOOKUP(B582,GenderOrderTable,3)","v":"Female"}]
[null,2,"Female",2,"25-29",8,"$17,500-$19,999",351,2,"25-39",2,"Female"]
[null,2,"Female",3,"30-34",8,"$17,500-$19,999",296,2,"25-39",2,"Female"]
[null,2,"Female",4,"35-39",8,"$17,500-$19,999",213,2,"25-39",2,"Female"]
[null,2,"Female",5,"40-44",8,"$17,500-$19,999",218,3,"40-75+",2,"Female"]
[null,2,"Female",6,"45-49",8,"$17,500-$19,999",256,3,"40-75+",2,"Female"]
[null,2,"Female",7,"50-54",8,"$17,500-$19,999",286,3,"40-75+",2,"Female"]
[null,2,"Female",8,"55-59",8,"$17,500-$19,999",311,3,"40-75+",2,"Female"]
[null,2,"Female",9,"60-64",8,"$17,500-$19,999",304,3,"40-75+",2,"Female"]
[null,2,"Female",10,"65-69",8,"$17,500-$19,999",421,3,"40-75+",2,"Female"]
[null,2,"Female",11,"70-74",8,"$17,500-$19,999",437,3,"40-75+",2,"Female"]
[null,2,"Female",12,"75+",8,"$17,500-$19,999",748,3,"40-75+",2,"Female"]
[null,2,"Female",1,"15-24",9,"$20,000-$22,499",689,1,"15-24",2,"Female"]
[null,2,"Female",2,"25-29",9,"$20,000-$22,499",531,2,"25-39",2,"Female"]
[null,2,"Female",3,"30-34",9,"$20,000-$22,499",513,2,"25-39",2,"Female"]
[null,2,"Female",4,"35-39",9,"$20,000-$22,499",505,2,"25-39",2,"Female"]
[null,2,"Female",5,"40-44",9,"$20,000-$22,499",448,3,"40-75+",2,"Female"]
[null,2,"Female",6,"45-49",9,"$20,000-$22,499",466,3,"40-75+",2,"Female"]
[null,2,"Female",7,"50-54",9,"$20,000-$22,499",494,3,"40-75+",2,"Female"]
[null,2,"Female",8,"55-59",9,"$20,000-$22,499",460,3,"40-75+",2,"Female"]
[null,2,"Female",9,"60-64",9,"$20,000-$22,499",450,3,"40-75+",2,"Female"]
[null,2,"Female",10,"65-69",9,"$20,000-$22,499",410,3,"40-75+",2,"Female"]
[null,2,"Female",11,"70-74",9,"$20,000-$22,499",342,3,"40-75+",2,"Female"]
[null,2,"Female",12,"75+",9,"$20,000-$22,499",696,3,"40-75+",2,"Female"]
[null,2,"Female",1,"15-24",10,"$22,500-$24,999",349,1,"15-24",2,"Female"]
[null,2,"Female",2,"25-29",10,"$22,500-$24,999",342,2,"25-39",2,"Female"]
[null,2,"Female",3,"30-34",10,"$22,500-$24,999",286,2,"25-39",2,"Female"]
[null,2,"Female",4,"35-39",10,"$22,500-$24,999",219,2,"25-39",2,"Female"]
[null,2,"Female",5,"40-44",10,"$22,500-$24,999",218,3,"40-75+",2,"Female"]
[null,2,"Female",6,"45-49",10,"$22,500-$24,999",275,3,"40-75+",2,"Female"]
[null,2,"Female",7,"50-54",10,"$22,500-$24,999",254,3,"40-75+",2,"Female"]
[null,2,"Female",8,"55-59",10,"$22,500-$24,999",300,3,"40-75+",2,"Female"]
[null,2,"Female",9,"60-64",10,"$22,500-$24,999",302,3,"40-75+",2,"Female"]
[null,2,"Female",10,"65-69",10,"$22,500-$24,999",326,3,"40-75+",2,"Female"]
[null,2,"Female",11,"70-74",10,"$22,500-$24,999",295,3,"40-75+",2,"Female"]
[null,2,"Female",12,"75+",10,"$22,500-$24,999",590,3,"40-75+",2,"Female"]
[null,2,"Female",1,"15-24",11,"$25,000-$27,499",537,1,"15-24",2,"Female"]
[null,2,"Female",2,"25-29",11,"$25,000-$27,499",543,2,"25-39",2,"Female"]
[null,2,"Female",3,"30-34",11,"$25,000-$27,499",548,2,"25-39",2,"Female"]
[null,2,"Female",4,"35-39",11,"$25,000-$27,499",344,2,"25-39",2,"Female"]
[null,2,"Female",5,"40-44",11,"$25,000-$27,499",373,3,"40-75+",2,"Female"]
[null,2,"Female",6,"45-49",11,"$25,000-$27,499",430,3,"40-75+",2,"Female"]
[null,2,"Female",7,"50-54",11,"$25,000-$27,499",429,3,"40-75+",2,"Female"]
[null,2,"Female",8,"55-59",11,"$25,000-$27,499",472,3,"40-75+",2,"Female"]
[null,2,"Female",9,"60-64",11,"$25,000-$27,499",380,3,"40-75+",2,"Female"]
[null,2,"Female",10,"65-69",11,"$25,000-$27,499",317,3,"40-75+",2,"Female"]
[null,2,"Female",11,"70-74",11,"$25,000-$27,499",248,3,"40-75+",2,"Female"]
[null,2,"Female",12,"75+",11,"$25,000-$27,499",409,3,"40-75+",2,"Female"]
[null,2,"Female",1,"15-24",12,"$27,500-$29,999",194,1,"15-24",2,"Female"]
[null,2,"Female",2,"25-29",12,"$27,500-$29,999",303,2,"25-39",2,"Female"]
[null,2,"Female",3,"30-34",12,"$27,500-$29,999",204,2,"25-39",2,"Female"]
[null,2,"Female",4,"35-39",12,"$27,500-$29,999",240,2,"25-39",2,"Female"]
[null,2,"Female",5,"40-44",12,"$27,500-$29,999",225,3,"40-75+",2,"Female"]
[null,2,"Female",6,"45-49",12,"$27,500-$29,999",199,3,"40-75+",2,"Female"]
[null,2,"Female",7,"50-54",12,"$27,500-$29,999",235,3,"40-75+",2,"Female"]
[null,2,"Female",8,"55-59",12,"$27,500-$29,999",273,3,"40-75+",2,"Female"]
[null,2,"Female",9,"60-64",12,"$27,500-$29,999",216,3,"40-75+",2,"Female"]
[null,2,"Female",10,"65-69",12,"$27,500-$29,999",262,3,"40-75+",2,"Female"]
[null,2,"Female",11,"70-74",12,"$27,500-$29,999",187,3,"40-75+",2,"Female"]
[null,2,"Female",12,"75+",12,"$27,500-$29,999",373,3,"40-75+",2,"Female"]
[null,2,"Female",1,"15-24",13,"$30,000-$32,499",420,1,"15-24",2,"Female"]
[null,2,"Female",2,"25-29",13,"$30,000-$32,499",620,2,"25-39",2,"Female"]
[null,2,"Female",3,"30-34",13,"$30,000-$32,499",556,2,"25-39",2,"Female"]
[null,2,"Female",4,"35-39",13,"$30,000-$32,499",461,2,"25-39",2,"Female"]
[null,2,"Female",5,"40-44",13,"$30,000-$32,499",421,{"$f":"VLOOKUP(D646,AgeOrderTable,2)","v":3},{"$f":"VLOOKUP(D646,AgeOrderTable,3)","v":"40-75+"},{"$f":"VLOOKUP(B646,GenderOrderTable,2)","v":2},{"$f":"VLOOKUP(B646,GenderOrderTable,3)","v":"Female"}]
[null,2,"Female",6,"45-49",13,"$30,000-$32,499",503,3,"40-75+",2,"Female"]
[null,2,"Female",7,"50-54",13,"$30,000-$32,499",519,3,"40-75+",2,"Female"]
[null,2,"Female",8,"55-59",13,"$30,000-$32,499",523,3,"40-75+",2,"Female"]
[null,2,"Female",9,"60-64",13,"$30,000-$32,499",466,3,"40-75+",2,"Female"]
[null,2,"Female",10,"65-69",13,"$30,000-$32,499",258,3,"40-75+",2,"Female"]
[null,2,"Female",11,"70-74",13,"$30,000-$32,499",198,3,"40-75+",2,"Female"]
[null,2,"Female",12,"75+",13,"$30,000-$32,499",302,3,"40-75+",2,"Female"]
[null,2,"Female",1,"15-24",14,"$32,500-$34,999",168,1,"15-24",2,"Female"]
[null,2,"Female",2,"25-29",14,"$32,500-$34,999",244,2,"25-39",2,"Female"]
[null,2,"Female",3,"30-34",14,"$32,500-$34,999",190,2,"25-39",2,"Female"]
[null,2,"Female",4,"35-39",14,"$32,500-$34,999",156,2,"25-39",2,"Female"]
[null,2,"Female",5,"40-44",14,"$32,500-$34,999",153,3,"40-75+",2,"Female"]
[null,2,"Female",6,"45-49",14,"$32,500-$34,999",175,3,"40-75+",2,"Female"]
[null,2,"Female",7,"50-54",14,"$32,500-$34,999",222,3,"40-75+",2,"Female"]
[null,2,"Female",8,"55-59",14,"$32,500-$34,999",194,3,"40-75+",2,"Female"]
[null,2,"Female",9,"60-64",14,"$32,500-$34,999",185,3,"40-75+",2,"Female"]
[null,2,"Female",10,"65-69",14,"$32,500-$34,999",236,3,"40-75+",2,"Female"]
[null,2,"Female",11,"70-74",14,"$32,500-$34,999",138,3,"40-75+",2,"Female"]
[null,2,"Female",12,"75+",14,"$32,500-$34,999",237,3,"40-75+",2,"Female"]
[null,2,"Female",1,"15-24",15,"$35,000-$37,499",216,1,"15-24",2,"Female"]
[null,2,"Female",2,"25-29",15,"$35,000-$37,499",486,2,"25-39",2,"Female"]
[null,2,"Female",3,"30-34",15,"$35,000-$37,499",474,2,"25-39",2,"Female"]
[null,2,"Female",4,"35-39",15,"$35,000-$37,499",337,2,"25-39",2,"Female"]
[null,2,"Female",5,"40-44",15,"$35,000-$37,499",318,3,"40-75+",2,"Female"]
[null,2,"Female",6,"45-49",15,"$35,000-$37,499",381,3,"40-75+",2,"Female"]
[null,2,"Female",7,"50-54",15,"$35,000-$37,499",466,3,"40-75+",2,"Female"]
[null,2,"Female",8,"55-59",15,"$35,000-$37,499",377,3,"40-75+",2,"Female"]
[null,2,"Female",9,"60-64",15,"$35,000-$37,499",240,3,"40-75+",2,"Female"]
[null,2,"Female",10,"65-69",15,"$35,000-$37,499",214,3,"40-75+",2,"Female"]
[null,2,"Female",11,"70-74",15,"$35,000-$37,499",166,3,"40-75+",2,"Female"]
[null,2,"Female",12,"75+",15,"$35,000-$37,499",196,3,"40-75+",2,"Female"]
[null,2,"Female",1,"15-24",16,"$37,500-$39,999",113,1,"15-24",2,"Female"]
[null,2,"Female",2,"25-29",16,"$37,500-$39,999",236,2,"25-39",2,"Female"]
[null,2,"Female",3,"30-34",16,"$37,500-$39,999",176,2,"25-39",2,"Female"]
[null,2,"Female",4,"35-39",16,"$37,500-$39,999",142,2,"25-39",2,"Female"]
[null,2,"Female",5,"40-44",16,"$37,500-$39,999",167,3,"40-75+",2,"Female"]
[null,2,"Female",6,"45-49",16,"$37,500-$39,999",198,3,"40-75+",2,"Female"]
[null,2,"Female",7,"50-54",16,"$37,500-$39,999",201,3,"40-75+",2,"Female"]
[null,2,"Female",8,"55-59",16,"$37,500-$39,999",218,3,"40-75+",2,"Female"]
[null,2,"Female",9,"60-64",16,"$37,500-$39,999",179,3,"40-75+",2,"Female"]
[null,2,"Female",10,"65-69",16,"$37,500-$39,999",150,3,"40-75+",2,"Female"]
[null,2,"Female",11,"70-74",16,"$37,500-$39,999",126,3,"40-75+",2,"Female"]
[null,2,"Female",12,"75+",16,"$37,500-$39,999",194,3,"40-75+",2,"Female"]
[null,2,"Female",1,"15-24",17,"$40,000-$42,499",190,1,"15-24",2,"Female"]
[null,2,"Female",2,"25-29",17,"$40,000-$42,499",458,2,"25-39",2,"Female"]
[null,2,"Female",3,"30-34",17,"$40,000-$42,499",399,2,"25-39",2,"Female"]
[null,2,"Female",4,"35-39",17,"$40,000-$42,499",389,2,"25-39",2,"Female"]
[null,2,"Female",5,"40-44",17,"$40,000-$42,499",416,3,"40-75+",2,"Female"]
[null,2,"Female",6,"45-49",17,"$40,000-$42,499",371,3,"40-75+",2,"Female"]
[null,2,"Female",7,"50-54",17,"$40,000-$42,499",402,3,"40-75+",2,"Female"]
[null,2,"Female",8,"55-59",17,"$40,000-$42,499",334,3,"40-75+",2,"Female"]
[null,2,"Female",9,"60-64",17,"$40,000-$42,499",295,3,"40-75+",2,"Female"]
[null,2,"Female",10,"65-69",17,"$40,000-$42,499",182,3,"40-75+",2,"Female"]
[null,2,"Female",11,"70-74",17,"$40,000-$42,499",98,3,"40-75+",2,"Female"]
[null,2,"Female",12,"75+",17,"$40,000-$42,499",138,3,"40-75+",2,"Female"]
[null,2,"Female",1,"15-24",18,"$42,500-$44,999",48,1,"15-24",2,"Female"]
[null,2,"Female",2,"25-29",18,"$42,500-$44,999",161,2,"25-39",2,"Female"]
[null,2,"Female",3,"30-34",18,"$42,500-$44,999",142,2,"25-39",2,"Female"]
[null,2,"Female",4,"35-39",18,"$42,500-$44,999",171,2,"25-39",2,"Female"]
[null,2,"Female",5,"40-44",18,"$42,500-$44,999",117,3,"40-75+",2,"Female"]
[null,2,"Female",6,"45-49",18,"$42,500-$44,999",192,3,"40-75+",2,"Female"]
[null,2,"Female",7,"50-54",18,"$42,500-$44,999",132,3,"40-75+",2,"Female"]
[null,2,"Female",8,"55-59",18,"$42,500-$44,999",116,3,"40-75+",2,"Female"]
[null,2,"Female",9,"60-64",18,"$42,500-$44,999",160,{"$f":"VLOOKUP(D710,AgeOrderTable,2)","v":3},{"$f":"VLOOKUP(D710,AgeOrderTable,3)","v":"40-75+"},{"$f":"VLOOKUP(B710,GenderOrderTable,2)","v":2},{"$f":"VLOOKUP(B710,GenderOrderTable,3)","v":"Female"}]
[null,2,"Female",10,"65-69",18,"$42,500-$44,999",127,3,"40-75+",2,"Female"]
[null,2,"Female",11,"70-74",18,"$42,500-$44,999",60,3,"40-75+",2,"Female"]
[null,2,"Female",12,"75+",18,"$42,500-$44,999",88,3,"40-75+",2,"Female"]
[null,2,"Female",1,"15-24",19,"$45,000-$47,499",131,1,"15-24",2,"Female"]
[null,2,"Female",2,"25-29",19,"$45,000-$47,499",247,2,"25-39",2,"Female"]
[null,2,"Female",3,"30-34",19,"$45,000-$47,499",270,2,"25-39",2,"Female"]
[null,2,"Female",4,"35-39",19,"$45,000-$47,499",319,2,"25-39",2,"Female"]
[null,2,"Female",5,"40-44",19,"$45,000-$47,499",278,3,"40-75+",2,"Female"]
[null,2,"Female",6,"45-49",19,"$45,000-$47,499",277,3,"40-75+",2,"Female"]
[null,2,"Female",7,"50-54",19,"$45,000-$47,499",297,3,"40-75+",2,"Female"]
[null,2,"Female",8,"55-59",19,"$45,000-$47,499",308,3,"40-75+",2,"Female"]
[null,2,"Female",9,"60-64",19,"$45,000-$47,499",216,3,"40-75+",2,"Female"]
[null,2,"Female",10,"65-69",19,"$45,000-$47,499",161,3,"40-75+",2,"Female"]
[null,2,"Female",11,"70-74",19,"$45,000-$47,499",99,3,"40-75+",2,"Female"]
[null,2,"Female",12,"75+",19,"$45,000-$47,499",119,3,"40-75+",2,"Female"]
[null,2,"Female",1,"15-24",20,"$47,500-$49,999",63,1,"15-24",2,"Female"]
[null,2,"Female",2,"25-29",20,"$47,500-$49,999",127,2,"25-39",2,"Female"]
[null,2,"Female",3,"30-34",20,"$47,500-$49,999",146,2,"25-39",2,"Female"]
[null,2,"Female",4,"35-39",20,"$47,500-$49,999",165,2,"25-39",2,"Female"]
[null,2,"Female",5,"40-44",20,"$47,500-$49,999",167,3,"40-75+",2,"Female"]
[null,2,"Female",6,"45-49",20,"$47,500-$49,999",169,3,"40-75+",2,"Female"]
[null,2,"Female",7,"50-54",20,"$47,500-$49,999",152,3,"40-75+",2,"Female"]
[null,2,"Female",8,"55-59",20,"$47,500-$49,999",144,3,"40-75+",2,"Female"]
[null,2,"Female",9,"60-64",20,"$47,500-$49,999",117,3,"40-75+",2,"Female"]
[null,2,"Female",10,"65-69",20,"$47,500-$49,999",98,3,"40-75+",2,"Female"]
[null,2,"Female",11,"70-74",20,"$47,500-$49,999",54,3,"40-75+",2,"Female"]
[null,2,"Female",12,"75+",20,"$47,500-$49,999",124,3,"40-75+",2,"Female"]
[null,2,"Female",1,"15-24",21,"$50,000-$52,499",92,1,"15-24",2,"Female"]
[null,2,"Female",2,"25-29",21,"$50,000-$52,499",301,2,"25-39",2,"Female"]
[null,2,"Female",3,"30-34",21,"$50,000-$52,499",342,2,"25-39",2,"Female"]
[null,2,"Female",4,"35-39",21,"$50,000-$52,499",312,2,"25-39",2,"Female"]
[null,2,"Female",5,"40-44",21,"$50,000-$52,499",280,3,"40-75+",2,"Female"]
[null,2,"Female",6,"45-49",21,"$50,000-$52,499",370,3,"40-75+",2,"Female"]
[null,2,"Female",7,"50-54",21,"$50,000-$52,499",379,3,"40-75+",2,"Female"]
[null,2,"Female",8,"55-59",21,"$50,000-$52,499",364,3,"40-75+",2,"Female"]
[null,2,"Female",9,"60-64",21,"$50,000-$52,499",266,3,"40-75+",2,"Female"]
[null,2,"Female",10,"65-69",21,"$50,000-$52,499",157,3,"40-75+",2,"Female"]
[null,2,"Female",11,"70-74",21,"$50,000-$52,499",78,3,"40-75+",2,"Female"]
[null,2,"Female",12,"75+",21,"$50,000-$52,499",95,3,"40-75+",2,"Female"]
[null,2,"Female",1,"15-24",22,"$52,500-$54,999",44,1,"15-24",2,"Female"]
[null,2,"Female",2,"25-29",22,"$52,500-$54,999",90,2,"25-39",2,"Female"]
[null,2,"Female",3,"30-34",22,"$52,500-$54,999",75,2,"25-39",2,"Female"]
[null,2,"Female",4,"35-39",22,"$52,500-$54,999",113,2,"25-39",2,"Female"]
[null,2,"Female",5,"40-44",22,"$52,500-$54,999",96,3,"40-75+",2,"Female"]
[null,2,"Female",6,"45-49",22,"$52,500-$54,999",89,3,"40-75+",2,"Female"]
[null,2,"Female",7,"50-54",22,"$52,500-$54,999",129,3,"40-75+",2,"Female"]
[null,2,"Female",8,"55-59",22,"$52,500-$54,999",135,3,"40-75+",2,"Female"]
[null,2,"Female",9,"60-64",22,"$52,500-$54,999",112,3,"40-75+",2,"Female"]
[null,2,"Female",10,"65-69",22,"$52,500-$54,999",59,3,"40-75+",2,"Female"]
[null,2,"Female",11,"70-74",22,"$52,500-$54,999",43,3,"40-75+",2,"Female"]
[null,2,"Female",12,"75+",22,"$52,500-$54,999",85,3,"40-75+",2,"Female"]
[null,2,"Female",1,"15-24",23,"$55,000-$57,499",72,1,"15-24",2,"Female"]
[null,2,"Female",2,"25-29",23,"$55,000-$57,499",167,2,"25-39",2,"Female"]
[null,2,"Female",3,"30-34",23,"$55,000-$57,499",228,2,"25-39",2,"Female"]
[null,2,"Female",4,"35-39",23,"$55,000-$57,499",171,2,"25-39",2,"Female"]
[null,2,"Female",5,"40-44",23,"$55,000-$57,499",192,3,"40-75+",2,"Female"]
[null,2,"Female",6,"45-49",23,"$55,000-$57,499",125,3,"40-75+",2,"Female"]
[null,2,"Female",7,"50-54",23,"$55,000-$57,499",207,3,"40-75+",2,"Female"]
[null,2,"Female",8,"55-59",23,"$55,000-$57,499",185,3,"40-75+",2,"Female"]
[null,2,"Female",9,"60-64",23,"$55,000-$57,499",116,3,"40-75+",2,"Female"]
[null,2,"Female",10,"65-69",23,"$55,000-$57,499",72,3,"40-75+",2,"Female"]
[null,2,"Female",11,"70-74",23,"$55,000-$57,499",46,3,"40-75+",2,"Female"]
[null,2,"Female",12,"75+",23,"$55,000-$57,499",56,3,"40-75+",2,"Female"]
[null,2,"Female",1,"15-24",24,"$57,500-$59,999",14,{"$f":"VLOOKUP(D774,AgeOrderTable,2)","v":1},{"$f":"VLOOKUP(D774,AgeOrderTable,3)","v":"15-24"},{"$f":"VLOOKUP(B774,GenderOrderTable,2)","v":2},{"$f":"VLOOKUP(B774,GenderOrderTable,3)","v":"Female"}]
[null,2,"Female",2,"25-29",24,"$57,500-$59,999",91,2,"25-39",2,"Female"]
[null,2,"Female",3,"30-34",24,"$57,500-$59,999",89,2,"25-39",2,"Female"]
[null,2,"Female",4,"35-39",24,"$57,500-$59,999",102,2,"25-39",2,"Female"]
[null,2,"Female",5,"40-44",24,"$57,500-$59,999",126,3,"40-75+",2,"Female"]
[null,2,"Female",6,"45-49",24,"$57,500-$59,999",111,3,"40-75+",2,"Female"]
[null,2,"Female",7,"50-54",24,"$57,500-$59,999",94,3,"40-75+",2,"Female"]
[null,2,"Female",8,"55-59",24,"$57,500-$59,999",81,3,"40-75+",2,"Female"]
[null,2,"Female",9,"60-64",24,"$57,500-$59,999",67,3,"40-75+",2,"Female"]
[null,2,"Female",10,"65-69",24,"$57,500-$59,999",70,3,"40-75+",2,"Female"]
[null,2,"Female",11,"70-74",24,"$57,500-$59,999",33,3,"40-75+",2,"Female"]
[null,2,"Female",12,"75+",24,"$57,500-$59,999",59,3,"40-75+",2,"Female"]
[null,2,"Female",1,"15-24",25,"$60,000-$62,499",28,1,"15-24",2,"Female"]
[null,2,"Female",2,"25-29",25,"$60,000-$62,499",270,2,"25-39",2,"Female"]
[null,2,"Female",3,"30-34",25,"$60,000-$62,499",246,2,"25-39",2,"Female"]
[null,2,"Female",4,"35-39",25,"$60,000-$62,499",246,2,"25-39",2,"Female"]
[null,2,"Female",5,"40-44",25,"$60,000-$62,499",189,3,"40-75+",2,"Female"]
[null,2,"Female",6,"45-49",25,"$60,000-$62,499",239,3,"40-75+",2,"Female"]
[null,2,"Female",7,"50-54",25,"$60,000-$62,499",236,3,"40-75+",2,"Female"]
[null,2,"Female",8,"55-59",25,"$60,000-$62,499",214,3,"40-75+",2,"Female"]
[null,2,"Female",9,"60-64",25,"$60,000-$62,499",169,3,"40-75+",2,"Female"]
[null,2,"Female",10,"65-69",25,"$60,000-$62,499",87,3,"40-75+",2,"Female"]
[null,2,"Female",11,"70-74",25,"$60,000-$62,499",46,3,"40-75+",2,"Female"]
[null,2,"Female",12,"75+",25,"$60,000-$62,499",80,3,"40-75+",2,"Female"]
[null,2,"Female",1,"15-24",26,"$62,500-$64,999",22,1,"15-24",2,"Female"]
[null,2,"Female",2,"25-29",26,"$62,500-$64,999",52,2,"25-39",2,"Female"]
[null,2,"Female",3,"30-34",26,"$62,500-$64,999",77,2,"25-39",2,"Female"]
[null,2,"Female",4,"35-39",26,"$62,500-$64,999",93,2,"25-39",2,"Female"]
[null,2,"Female",5,"40-44",26,"$62,500-$64,999",91,3,"40-75+",2,"Female"]
[null,2,"Female",6,"45-49",26,"$62,500-$64,999",87,3,"40-75+",2,"Female"]
[null,2,"Female",7,"50-54",26,"$62,500-$64,999",68,3,"40-75+",2,"Female"]
[null,2,"Female",8,"55-59",26,"$62,500-$64,999",67,3,"40-75+",2,"Female"]
[null,2,"Female",9,"60-64",26,"$62,500-$64,999",88,3,"40-75+",2,"Female"]
[null,2,"Female",10,"65-69",26,"$62,500-$64,999",74,3,"40-75+",2,"Female"]
[null,2,"Female",11,"70-74",26,"$62,500-$64,999",25,3,"40-75+",2,"Female"]
[null,2,"Female",12,"75+",26,"$62,500-$64,999",56,3,"40-75+",2,"Female"]
[null,2,"Female",1,"15-24",27,"$65,000-$67,499",22,1,"15-24",2,"Female"]
[null,2,"Female",2,"25-29",27,"$65,000-$67,499",103,2,"25-39",2,"Female"]
[null,2,"Female",3,"30-34",27,"$65,000-$67,499",142,2,"25-39",2,"Female"]
[null,2,"Female",4,"35-39",27,"$65,000-$67,499",145,2,"25-39",2,"Female"]
[null,2,"Female",5,"40-44",27,"$65,000-$67,499",126,3,"40-75+",2,"Female"]
[null,2,"Female",6,"45-49",27,"$65,000-$67,499",124,3,"40-75+",2,"Female"]
[null,2,"Female",7,"50-54",27,"$65,000-$67,499",181,3,"40-75+",2,"Female"]
[null,2,"Female",8,"55-59",27,"$65,000-$67,499",127,3,"40-75+",2,"Female"]
[null,2,"Female",9,"60-64",27,"$65,000-$67,499",150,3,"40-75+",2,"Female"]
[null,2,"Female",10,"65-69",27,"$65,000-$67,499",72,3,"40-75+",2,"Female"]
[null,2,"Female",11,"70-74",27,"$65,000-$67,499",69,3,"40-75+",2,"Female"]
[null,2,"Female",12,"75+",27,"$65,000-$67,499",42,3,"40-75+",2,"Female"]
[null,2,"Female",1,"15-24",28,"$67,500-$69,999",9,1,"15-24",2,"Female"]
[null,2,"Female",2,"25-29",28,"$67,500-$69,999",42,2,"25-39",2,"Female"]
[null,2,"Female",3,"30-34",28,"$67,500-$69,999",45,2,"25-39",2,"Female"]
[null,2,"Female",4,"35-39",28,"$67,500-$69,999",79,2,"25-39",2,"Female"]
[null,2,"Female",5,"40-44",28,"$67,500-$69,999",66,3,"40-75+",2,"Female"]
[null,2,"Female",6,"45-49",28,"$67,500-$69,999",79,3,"40-75+",2,"Female"]
[null,2,"Female",7,"50-54",28,"$67,500-$69,999",66,3,"40-75+",2,"Female"]
[null,2,"Female",8,"55-59",28,"$67,500-$69,999",59,3,"40-75+",2,"Female"]
[null,2,"Female",9,"60-64",28,"$67,500-$69,999",47,3,"40-75+",2,"Female"]
[null,2,"Female",10,"65-69",28,"$67,500-$69,999",44,3,"40-75+",2,"Female"]
[null,2,"Female",11,"70-74",28,"$67,500-$69,999",30,3,"40-75+",2,"Female"]
[null,2,"Female",12,"75+",28,"$67,500-$69,999",45,3,"40-75+",2,"Female"]
[null,2,"Female",1,"15-24",29,"$70,000-$72,499",29,1,"15-24",2,"Female"]
[null,2,"Female",2,"25-29",29,"$70,000-$72,499",101,2,"25-39",2,"Female"]
[null,2,"Female",3,"30-34",29,"$70,000-$72,499",120,2,"25-39",2,"Female"]
[null,2,"Female",4,"35-39",29,"$70,000-$72,499",132,2,"25-39",2,"Female"]
[null,2,"Female",5,"40-44",29,"$70,000-$72,499",153,{"$f":"VLOOKUP(D838,AgeOrderTable,2)","v":3},{"$f":"VLOOKUP(D838,AgeOrderTable,3)","v":"40-75+"},{"$f":"VLOOKUP(B838,GenderOrderTable,2)","v":2},{"$f":"VLOOKUP(B838,GenderOrderTable,3)","v":"Female"}]
[null,2,"Female",6,"45-49",29,"$70,000-$72,499",161,3,"40-75+",2,"Female"]
[null,2,"Female",7,"50-54",29,"$70,000-$72,499",188,3,"40-75+",2,"Female"]
[null,2,"Female",8,"55-59",29,"$70,000-$72,499",157,3,"40-75+",2,"Female"]
[null,2,"Female",9,"60-64",29,"$70,000-$72,499",108,3,"40-75+",2,"Female"]
[null,2,"Female",10,"65-69",29,"$70,000-$72,499",72,3,"40-75+",2,"Female"]
[null,2,"Female",11,"70-74",29,"$70,000-$72,499",22,3,"40-75+",2,"Female"]
[null,2,"Female",12,"75+",29,"$70,000-$72,499",21,3,"40-75+",2,"Female"]
[null,2,"Female",1,"15-24",30,"$72,500-$74,999",14,1,"15-24",2,"Female"]
[null,2,"Female",2,"25-29",30,"$72,500-$74,999",36,2,"25-39",2,"Female"]
[null,2,"Female",3,"30-34",30,"$72,500-$74,999",31,2,"25-39",2,"Female"]
[null,2,"Female",4,"35-39",30,"$72,500-$74,999",53,2,"25-39",2,"Female"]
[null,2,"Female",5,"40-44",30,"$72,500-$74,999",45,3,"40-75+",2,"Female"]
[null,2,"Female",6,"45-49",30,"$72,500-$74,999",79,3,"40-75+",2,"Female"]
[null,2,"Female",7,"50-54",30,"$72,500-$74,999",51,3,"40-75+",2,"Female"]
[null,2,"Female",8,"55-59",30,"$72,500-$74,999",42,3,"40-75+",2,"Female"]
[null,2,"Female",9,"60-64",30,"$72,500-$74,999",69,3,"40-75+",2,"Female"]
[null,2,"Female",10,"65-69",30,"$72,500-$74,999",32,3,"40-75+",2,"Female"]
[null,2,"Female",11,"70-74",30,"$72,500-$74,999",19,3,"40-75+",2,"Female"]
[null,2,"Female",12,"75+",30,"$72,500-$74,999",25,3,"40-75+",2,"Female"]
[null,2,"Female",1,"15-24",31,"$75,000-$77,499",18,1,"15-24",2,"Female"]
[null,2,"Female",2,"25-29",31,"$75,000-$77,499",114,2,"25-39",2,"Female"]
[null,2,"Female",3,"30-34",31,"$75,000-$77,499",135,2,"25-39",2,"Female"]
[null,2,"Female",4,"35-39",31,"$75,000-$77,499",124,2,"25-39",2,"Female"]
[null,2,"Female",5,"40-44",31,"$75,000-$77,499",123,3,"40-75+",2,"Female"]
[null,2,"Female",6,"45-49",31,"$75,000-$77,499",137,3,"40-75+",2,"Female"]
[null,2,"Female",7,"50-54",31,"$75,000-$77,499",142,3,"40-75+",2,"Female"]
[null,2,"Female",8,"55-59",31,"$75,000-$77,499",124,3,"40-75+",2,"Female"]
[null,2,"Female",9,"60-64",31,"$75,000-$77,499",116,3,"40-75+",2,"Female"]
[null,2,"Female",10,"65-69",31,"$75,000-$77,499",64,3,"40-75+",2,"Female"]
[null,2,"Female",11,"70-74",31,"$75,000-$77,499",23,3,"40-75+",2,"Female"]
[null,2,"Female",12,"75+",31,"$75,000-$77,499",37,3,"40-75+",2,"Female"]
[null,2,"Female",1,"15-24",32,"$77,500-$79,999",5,1,"15-24",2,"Female"]
[null,2,"Female",2,"25-29",32,"$77,500-$79,999",17,2,"25-39",2,"Female"]
[null,2,"Female",3,"30-34",32,"$77,500-$79,999",42,2,"25-39",2,"Female"]
[null,2,"Female",4,"35-39",32,"$77,500-$79,999",70,2,"25-39",2,"Female"]
[null,2,"Female",5,"40-44",32,"$77,500-$79,999",54,3,"40-75+",2,"Female"]
[null,2,"Female",6,"45-49",32,"$77,500-$79,999",48,3,"40-75+",2,"Female"]
[null,2,"Female",7,"50-54",32,"$77,500-$79,999",47,3,"40-75+",2,"Female"]
[null,2,"Female",8,"55-59",32,"$77,500-$79,999",78,3,"40-75+",2,"Female"]
[null,2,"Female",9,"60-64",32,"$77,500-$79,999",39,3,"40-75+",2,"Female"]
[null,2,"Female",10,"65-69",32,"$77,500-$79,999",42,3,"40-75+",2,"Female"]
[null,2,"Female",11,"70-74",32,"$77,500-$79,999",10,3,"40-75+",2,"Female"]
[null,2,"Female",12,"75+",32,"$77,500-$79,999",37,3,"40-75+",2,"Female"]
[null,2,"Female",1,"15-24",33,"$80,000-$82,499",11,1,"15-24",2,"Female"]
[null,2,"Female",2,"25-29",33,"$80,000-$82,499",80,2,"25-39",2,"Female"]
[null,2,"Female",3,"30-34",33,"$80,000-$82,499",92,2,"25-39",2,"Female"]
[null,2,"Female",4,"35-39",33,"$80,000-$82,499",115,2,"25-39",2,"Female"]
[null,2,"Female",5,"40-44",33,"$80,000-$82,499",88,3,"40-75+",2,"Female"]
[null,2,"Female",6,"45-49",33,"$80,000-$82,499",100,3,"40-75+",2,"Female"]
[null,2,"Female",7,"50-54",33,"$80,000-$82,499",79,3,"40-75+",2,"Female"]
[null,2,"Female",8,"55-59",33,"$80,000-$82,499",134,3,"40-75+",2,"Female"]
[null,2,"Female",9,"60-64",33,"$80,000-$82,499",81,3,"40-75+",2,"Female"]
[null,2,"Female",10,"65-69",33,"$80,000-$82,499",69,3,"40-75+",2,"Female"]
[null,2,"Female",11,"70-74",33,"$80,000-$82,499",20,3,"40-75+",2,"Female"]
[null,2,"Female",12,"75+",33,"$80,000-$82,499",18,3,"40-75+",2,"Female"]
[null,2,"Female",1,"15-24",34,"$82,500-$84,999",4,1,"15-24",2,"Female"]
[null,2,"Female",2,"25-29",34,"$82,500-$84,999",19,2,"25-39",2,"Female"]
[null,2,"Female",3,"30-34",34,"$82,500-$84,999",42,2,"25-39",2,"Female"]
[null,2,"Female",4,"35-39",34,"$82,500-$84,999",36,2,"25-39",2,"Female"]
[null,2,"Female",5,"40-44",34,"$82,500-$84,999",48,3,"40-75+",2,"Female"]
[null,2,"Female",6,"45-49",34,"$82,500-$84,999",41,3,"40-75+",2,"Female"]
[null,2,"Female",7,"50-54",34,"$82,500-$84,999",64,3,"40-75+",2,"Female"]
[null,2,"Female",8,"55-59",34,"$82,500-$84,999",51,3,"40-75+",2,"Female"]
[null,2,"Female",9,"60-64",34,"$82,500-$84,999",37,{"$f":"VLOOKUP(D902,AgeOrderTable,2)","v":3},{"$f":"VLOOKUP(D902,AgeOrderTable,3)","v":"40-75+"},{"$f":"VLOOKUP(B902,GenderOrderTable,2)","v":2},{"$f":"VLOOKUP(B902,GenderOrderTable,3)","v":"Female"}]
[null,2,"Female",10,"65-69",34,"$82,500-$84,999",40,3,"40-75+",2,"Female"]
[null,2,"Female",11,"70-74",34,"$82,500-$84,999",23,3,"40-75+",2,"Female"]
[null,2,"Female",12,"75+",34,"$82,500-$84,999",32,3,"40-75+",2,"Female"]
[null,2,"Female",1,"15-24",35,"$85,000-$87,499",9,1,"15-24",2,"Female"]
[null,2,"Female",2,"25-29",35,"$85,000-$87,499",25,2,"25-39",2,"Female"]
[null,2,"Female",3,"30-34",35,"$85,000-$87,499",45,2,"25-39",2,"Female"]
[null,2,"Female",4,"35-39",35,"$85,000-$87,499",46,2,"25-39",2,"Female"]
[null,2,"Female",5,"40-44",35,"$85,000-$87,499",54,3,"40-75+",2,"Female"]
[null,2,"Female",6,"45-49",35,"$85,000-$87,499",80,3,"40-75+",2,"Female"]
[null,2,"Female",7,"50-54",35,"$85,000-$87,499",65,3,"40-75+",2,"Female"]
[null,2,"Female",8,"55-59",35,"$85,000-$87,499",63,3,"40-75+",2,"Female"]
[null,2,"Female",9,"60-64",35,"$85,000-$87,499",65,3,"40-75+",2,"Female"]
[null,2,"Female",10,"65-69",35,"$85,000-$87,499",31,3,"40-75+",2,"Female"]
[null,2,"Female",11,"70-74",35,"$85,000-$87,499",13,3,"40-75+",2,"Female"]
[null,2,"Female",12,"75+",35,"$85,000-$87,499",10,3,"40-75+",2,"Female"]
[null,2,"Female",1,"15-24",36,"$87,500-$89,999",6,1,"15-24",2,"Female"]
[null,2,"Female",2,"25-29",36,"$87,500-$89,999",13,2,"25-39",2,"Female"]
[null,2,"Female",3,"30-34",36,"$87,500-$89,999",26,2,"25-39",2,"Female"]
[null,2,"Female",4,"35-39",36,"$87,500-$89,999",43,2,"25-39",2,"Female"]
[null,2,"Female",5,"40-44",36,"$87,500-$89,999",28,3,"40-75+",2,"Female"]
[null,2,"Female",6,"45-49",36,"$87,500-$89,999",34,3,"40-75+",2,"Female"]
[null,2,"Female",7,"50-54",36,"$87,500-$89,999",50,3,"40-75+",2,"Female"]
[null,2,"Female",8,"55-59",36,"$87,500-$89,999",43,3,"40-75+",2,"Female"]
[null,2,"Female",9,"60-64",36,"$87,500-$89,999",40,3,"40-75+",2,"Female"]
[null,2,"Female",10,"65-69",36,"$87,500-$89,999",28,3,"40-75+",2,"Female"]
[null,2,"Female",11,"70-74",36,"$87,500-$89,999",9,3,"40-75+",2,"Female"]
[null,2,"Female",12,"75+",36,"$87,500-$89,999",14,3,"40-75+",2,"Female"]
[null,2,"Female",1,"15-24",37,"$90,000-$92,499",4,1,"15-24",2,"Female"]
[null,2,"Female",2,"25-29",37,"$90,000-$92,499",59,2,"25-39",2,"Female"]
[null,2,"Female",3,"30-34",37,"$90,000-$92,499",82,2,"25-39",2,"Female"]
[null,2,"Female",4,"35-39",37,"$90,000-$92,499",63,2,"25-39",2,"Female"]
[null,2,"Female",5,"40-44",37,"$90,000-$92,499",81,3,"40-75+",2,"Female"]
[null,2,"Female",6,"45-49",37,"$90,000-$92,499",74,3,"40-75+",2,"Female"]
[null,2,"Female",7,"50-54",37,"$90,000-$92,499",72,3,"40-75+",2,"Female"]
[null,2,"Female",8,"55-59",37,"$90,000-$92,499",79,3,"40-75+",2,"Female"]
[null,2,"Female",9,"60-64",37,"$90,000-$92,499",80,3,"40-75+",2,"Female"]
[null,2,"Female",10,"65-69",37,"$90,000-$92,499",63,3,"40-75+",2,"Female"]
[null,2,"Female",11,"70-74",37,"$90,000-$92,499",22,3,"40-75+",2,"Female"]
[null,2,"Female",12,"75+",37,"$90,000-$92,499",12,3,"40-75+",2,"Female"]
[null,2,"Female",1,"15-24",38,"$92,500-$94,999",6,1,"15-24",2,"Female"]
[null,2,"Female",2,"25-29",38,"$92,500-$94,999",14,2,"25-39",2,"Female"]
[null,2,"Female",3,"30-34",38,"$92,500-$94,999",20,2,"25-39",2,"Female"]
[null,2,"Female",4,"35-39",38,"$92,500-$94,999",22,2,"25-39",2,"Female"]
[null,2,"Female",5,"40-44",38,"$92,500-$94,999",23,3,"40-75+",2,"Female"]
[null,2,"Female",6,"45-49",38,"$92,500-$94,999",24,3,"40-75+",2,"Female"]
[null,2,"Female",7,"50-54",38,"$92,500-$94,999",16,3,"40-75+",2,"Female"]
[null,2,"Female",8,"55-59",38,"$92,500-$94,999",36,3,"40-75+",2,"Female"]
[null,2,"Female",9,"60-64",38,"$92,500-$94,999",26,3,"40-75+",2,"Female"]
[null,2,"Female",10,"65-69",38,"$92,500-$94,999",36,3,"40-75+",2,"Female"]
[null,2,"Female",11,"70-74",38,"$92,500-$94,999",16,3,"40-75+",2,"Female"]
[null,2,"Female",12,"75+",38,"$92,500-$94,999",16,3,"40-75+",2,"Female"]
[null,2,"Female",1,"15-24",39,"$95,000-$97,499",2,1,"15-24",2,"Female"]
[null,2,"Female",2,"25-29",39,"$95,000-$97,499",24,2,"25-39",2,"Female"]
[null,2,"Female",3,"30-34",39,"$95,000-$97,499",38,2,"25-39",2,"Female"]
[null,2,"Female",4,"35-39",39,"$95,000-$97,499",57,2,"25-39",2,"Female"]
[null,2,"Female",5,"40-44",39,"$95,000-$97,499",35,3,"40-75+",2,"Female"]
[null,2,"Female",6,"45-49",39,"$95,000-$97,499",41,3,"40-75+",2,"Female"]
[null,2,"Female",7,"50-54",39,"$95,000-$97,499",27,3,"40-75+",2,"Female"]
[null,2,"Female",8,"55-59",39,"$95,000-$97,499",45,3,"40-75+",2,"Female"]
[null,2,"Female",9,"60-64",39,"$95,000-$97,499",33,3,"40-75+",2,"Female"]
[null,2,"Female",10,"65-69",39,"$95,000-$97,499",27,3,"40-75+",2,"Female"]
[null,2,"Female",11,"70-74",39,"$95,000-$97,499",13,3,"40-75+",2,"Female"]
[null,2,"Female",12,"75+",39,"$95,000-$97,499",9,3,"40-75+",2,"Female"]
[null,2,"Female",1,"15-24",40,"$97,500-$99,999",2,{"$f":"VLOOKUP(D966,AgeOrderTable,2)","v":1},{"$f":"VLOOKUP(D966,AgeOrderTable,3)","v":"15-24"},{"$f":"VLOOKUP(B966,GenderOrderTable,2)","v":2},{"$f":"VLOOKUP(B966,GenderOrderTable,3)","v":"Female"}]
[null,2,"Female",2,"25-29",40,"$97,500-$99,999",6,2,"25-39",2,"Female"]
[null,2,"Female",3,"30-34",40,"$97,500-$99,999",23,2,"25-39",2,"Female"]
[null,2,"Female",4,"35-39",40,"$97,500-$99,999",28,2,"25-39",2,"Female"]
[null,2,"Female",5,"40-44",40,"$97,500-$99,999",43,3,"40-75+",2,"Female"]
[null,2,"Female",6,"45-49",40,"$97,500-$99,999",24,3,"40-75+",2,"Female"]
[null,2,"Female",7,"50-54",40,"$97,500-$99,999",42,3,"40-75+",2,"Female"]
[null,2,"Female",8,"55-59",40,"$97,500-$99,999",45,3,"40-75+",2,"Female"]
[null,2,"Female",9,"60-64",40,"$97,500-$99,999",40,3,"40-75+",2,"Female"]
[null,2,"Female",10,"65-69",40,"$97,500-$99,999",16,3,"40-75+",2,"Female"]
[null,2,"Female",11,"70-74",40,"$97,500-$99,999",5,3,"40-75+",2,"Female"]
[null,2,"Female",12,"75+",40,"$97,500-$99,999",8,3,"40-75+",2,"Female"]
[null,2,"Female",1,"15-24",41,"$100,000+",73,1,"15-24",2,"Female"]
[null,2,"Female",2,"25-29",41,"$100,000+",264,2,"25-39",2,"Female"]
[null,2,"Female",3,"30-34",41,"$100,000+",431,2,"25-39",2,"Female"]
[null,2,"Female",4,"35-39",41,"$100,000+",655,2,"25-39",2,"Female"]
[null,2,"Female",5,"40-44",41,"$100,000+",710,3,"40-75+",2,"Female"]
[null,2,"Female",6,"45-49",41,"$100,000+",779,3,"40-75+",2,"Female"]
[null,2,"Female",7,"50-54",41,"$100,000+",789,3,"40-75+",2,"Female"]
[null,2,"Female",8,"55-59",41,"$100,000+",804,3,"40-75+",2,"Female"]
[null,2,"Female",9,"60-64",41,"$100,000+",569,3,"40-75+",2,"Female"]
[null,2,"Female",10,"65-69",41,"$100,000+",419,3,"40-75+",2,"Female"]
[null,2,"Female",11,"70-74",41,"$100,000+",186,3,"40-75+",2,"Female"]
[null,2,"Female",12,"75+",41,"$100,000+",205,3,"40-75+",2,"Female"]

{"sheet":"Feature importance","index":6,"n_rows":1,"n_cols":2,"rows_kept":1,"cut":false,"hidden":false,"merged":[[0,1,0,4]]}
["Directions:","Click the button to create or update tables and charts.  Calculations are based on the Main sheet's current scenario.   Only variables with validation criteria are included.  "]